program: Orca
programVersion: 5.0.2
elementType: O O O C C C C C C C C C C C C C C C C C C C C C C H H H H H H H H H H H H H H H H H H H H H H H H H H
charge: 0
multiplicity: 1
keywords: wb97x-d3
keywords: def2-TZVPP
keywords: def2/J RIJCOSX
keywords: DEFGRID2
keywords: scfconv7
keywords: smallprint printgap noloewdin
keywords: NOSOSCF
formula: C22H26O3
InChI: InChI=1/C22H26O3/c1-15(2)10-19-20(22(19,3)4)21(23)25-14-17-12-18(24-13-17)11-16-8-6-5-7-9-16/h5-10,12-13,19-20H,11,14H2,1-4H3
51 atoms
O  1.209599 -0.810615 1.18997
O  1.998154 -1.704362 -0.701307
O  -2.343209 -2.701083 -0.706764
C  2.376432 1.338359 -1.430902
C  3.69735 0.725773 -1.069529
C  2.520195 0.5622 -0.132389
C  2.19019 2.829464 -1.289286
C  1.606426 0.758401 -2.591183
C  4.852469 1.537687 -0.629823
C  1.902448 -0.7647 0.053228
C  6.065201 1.564523 -1.191889
C  7.149822 2.437099 -0.633996
C  6.461617 0.770643 -2.399263
C  0.497559 -2.019845 1.496956
C  -0.78543 -2.099932 0.75137
C  -1.96349 -1.313481 0.974331
C  -1.079765 -2.916566 -0.285646
C  -2.876094 -1.7201 0.060734
C  -4.277083 -1.317054 -0.241761
C  -4.762134 -0.258719 0.710099
C  -5.466881 -0.605968 1.858729
C  -4.484328 1.085099 0.474621
C  -5.891031 0.368387 2.75233
C  -4.90415 2.061549 1.367176
C  -5.609738 1.705754 2.509172
H  3.93663 -0.167252 -1.637919
H  2.531532 1.177859 0.760864
H  1.129449 3.077433 -1.214443
H  2.588352 3.348758 -2.163672
H  2.684479 3.238839 -0.409108
H  0.52972 0.860656 -2.438836
H  1.821935 -0.292389 -2.770129
H  1.85988 1.301443 -3.504146
H  4.686268 2.171482 0.236884
H  8.021806 1.844595 -0.343521
H  7.500752 3.153713 -1.38164
H  6.82002 2.998244 0.24046
H  7.325266 0.136932 -2.180523
H  5.669239 0.132221 -2.785343
H  6.769096 1.437641 -3.209425
H  0.318219 -1.962991 2.569947
H  1.121041 -2.894695 1.308027
H  -2.100027 -0.552408 1.726534
H  -0.515734 -3.67649 -0.804162
H  -4.930164 -2.193343 -0.188984
H  -4.337347 -0.95145 -1.271744
H  -5.689123 -1.648531 2.055216
H  -3.934748 1.370653 -0.415053
H  -6.443464 0.081739 3.638294
H  -4.682356 3.10266 1.169244
H  -5.941343 2.467142 3.203594
elementType: O C H
totalener: -1079.75544650 hartree
nucrepener: 2059.95756849 hartree
electener: -3139.71301499 hartree
oneelecener: -5559.13407069 hartree
twoeener: 2419.42105570 hartree
cpcmener: -0.02466805 hartree
kineticenergy: 1074.85368909 hartree
xcener: -106.460503122241 hartree
chargesum: -0.0000000
charge: -0.284763 -0.474356 -0.280608 0.118409 0.033496 -0.119615 -0.263938 -0.281116 -0.276732 0.405471 -0.042824 -0.221497 -0.251898 0.089727 -0.106012 -0.294557 -0.018449 0.173565 -0.000551 -0.000221 -0.185886 -0.192748 -0.155640 -0.155105 -0.164624 0.090870 0.087386 0.097507 0.096308 0.086903 0.098314 0.092795 0.095188 0.117414 0.093320 0.092450 0.088816 0.094948 0.090341 0.095608 0.120039 0.117395 0.159911 0.172414 0.103751 0.107288 0.138318 0.142140 0.157062 0.156188 0.157797
qa: -0.2848 -0.4744 -0.2806 0.1184 0.0335 -0.1196 -0.2639 -0.2811 -0.2767 0.4055 -0.0428 -0.2215 -0.2519 0.0897 -0.1060 -0.2946 -0.0184 0.1736 -0.0006 -0.0002 -0.1859 -0.1927 -0.1556 -0.1551 -0.1646 0.0909 0.0874 0.0975 0.0963 0.0869 0.0983 0.0928 0.0952 0.1174 0.0933 0.0924 0.0888 0.0949 0.0903 0.0956 0.1200 0.1174 0.1599 0.1724 0.1038 0.1073 0.1383 0.1421 0.1571 0.1562 0.1578
va: 2.1212 2.0326 2.2751 3.6898 3.7664 3.8769 3.9055 3.9031 3.8680 4.1732 3.7486 3.9231 3.9434 3.8313 3.6787 3.9791 3.9567 3.6839 3.8195 3.6322 3.9342 3.9270 3.8986 3.8989 3.8941 1.0334 1.0385 1.0024 1.0027 1.0054 0.9994 1.0197 1.0008 1.0098 0.9962 0.9965 1.0086 0.9973 1.0094 0.9973 0.9913 1.0098 1.0040 1.0009 1.0082 1.0048 1.0046 1.0035 0.9908 0.9913 0.9903
dispcorr: -0.022140431 hartree
energy: -1079.777586928130
dipole: 24.56549 -24.72262 -0.15713 17.04605 -16.16082 0.88522 -9.20575 9.67251 0.46676
magnitude: 1.01300 au
magnitude: 2.57485 debye
