program: Orca
programVersion: 5.0.2
elementType: O O O C C C C C C C C C C C C C C C C C C C C C C H H H H H H H H H H H H H H H H H H H H H H H H H H
charge: 0
multiplicity: 1
keywords: wb97x-d3
keywords: def2-TZVPP
keywords: def2/J RIJCOSX
keywords: DEFGRID2
keywords: scfconv7
keywords: smallprint printgap noloewdin
keywords: NOSOSCF
formula: C22H26O3
InChI: InChI=1/C22H26O3/c1-15(2)10-19-20(22(19,3)4)21(23)25-14-17-12-18(24-13-17)11-16-8-6-5-7-9-16/h5-10,12-13,19-20H,11,14H2,1-4H3
51 atoms
O  1.857416 -2.04257 -0.23572
O  2.204995 -0.671471 1.496591
O  -2.494645 -1.355015 -0.753403
C  4.780028 0.209699 -0.020649
C  3.662676 1.086929 -0.462253
C  3.492824 -0.432192 -0.506763
C  5.964065 0.018806 -0.938832
C  5.163663 0.185061 1.439223
C  3.673247 1.8671 -1.722467
C  2.481048 -1.035344 0.376095
C  2.564589 2.306602 -2.324919
C  2.620014 3.139187 -3.567286
C  1.193419 2.015722 -1.785094
C  0.723133 -2.638735 0.413935
C  -0.518728 -1.87636 0.115099
C  -0.88894 -0.558133 0.545066
C  -1.535261 -2.299204 -0.671994
C  -2.091136 -0.293522 -0.016623
C  -3.003773 0.875788 0.06056
C  -4.253216 0.566983 0.849881
C  -4.23548 0.628514 2.240974
C  -5.427399 0.183398 0.210145
C  -5.369776 0.321174 2.977855
C  -6.564389 -0.127059 0.945354
C  -6.539717 -0.056886 2.331046
H  3.10513 1.543787 0.352241
H  3.548169 -0.877396 -1.493464
H  5.680362 -0.030246 -1.990306
H  6.487622 -0.908503 -0.698114
H  6.677482 0.837745 -0.824273
H  4.347902 0.458458 2.103662
H  5.975336 0.895035 1.61129
H  5.525789 -0.801421 1.735647
H  4.63878 2.113884 -2.154295
H  2.107968 2.641311 -4.395083
H  2.108825 4.094843 -3.421172
H  3.643048 3.348859 -3.87991
H  1.116813 1.014955 -1.357464
H  0.918328 2.721868 -0.996494
H  0.432848 2.100919 -2.562478
H  0.899562 -2.728393 1.486493
H  0.655488 -3.644973 0.002231
H  -0.336239 0.106579 1.188672
H  -1.704633 -3.215574 -1.216568
H  -3.269977 1.209947 -0.945984
H  -2.455356 1.694146 0.529449
H  -3.326122 0.923727 2.752228
H  -5.457524 0.132979 -0.87205
H  -5.341732 0.380861 4.05856
H  -7.471936 -0.42063 0.432985
H  -7.42599 -0.29616 2.904768
elementType: O C H
totalener: -1079.75210283 hartree
nucrepener: 2101.59288644 hartree
electener: -3181.34498927 hartree
oneelecener: -5642.37464211 hartree
twoeener: 2461.02965284 hartree
cpcmener: -0.02412804 hartree
kineticenergy: 1074.86182891 hartree
xcener: -106.460332947012 hartree
chargesum: 0.0000000
charge: -0.287653 -0.480902 -0.279807 0.169051 -0.045126 -0.089218 -0.293876 -0.279053 -0.288049 0.397228 0.009676 -0.223328 -0.272969 0.075143 -0.063319 -0.362045 -0.040541 0.229541 -0.053554 0.055880 -0.199702 -0.196284 -0.158393 -0.157580 -0.169665 0.103809 0.090202 0.090104 0.098252 0.100056 0.093197 0.092102 0.098732 0.124487 0.094502 0.098453 0.086075 0.078485 0.108981 0.098836 0.116719 0.116185 0.163647 0.174214 0.112849 0.112633 0.142457 0.139077 0.156780 0.156146 0.157560
qa: -0.2877 -0.4809 -0.2798 0.1691 -0.0451 -0.0892 -0.2939 -0.2791 -0.2880 0.3972 0.0097 -0.2233 -0.2730 0.0751 -0.0633 -0.3620 -0.0405 0.2295 -0.0536 0.0559 -0.1997 -0.1963 -0.1584 -0.1576 -0.1697 0.1038 0.0902 0.0901 0.0983 0.1001 0.0932 0.0921 0.0987 0.1245 0.0945 0.0985 0.0861 0.0785 0.1090 0.0988 0.1167 0.1162 0.1636 0.1742 0.1128 0.1126 0.1425 0.1391 0.1568 0.1561 0.1576
va: 2.1086 2.0157 2.2823 3.7003 3.8412 3.8276 3.9165 3.8788 3.8552 4.1278 3.7006 3.9272 3.9593 3.8543 3.6722 3.9904 3.9760 3.6266 3.8033 3.5841 3.9442 3.9587 3.9034 3.8998 3.8987 1.0221 1.0344 1.0018 1.0027 0.9990 1.0206 1.0010 0.9991 1.0038 0.9948 0.9936 1.0082 0.9980 0.9956 1.0054 1.0099 0.9975 1.0202 0.9946 1.0071 1.0095 1.0037 1.0067 0.9912 0.9912 0.9905
dispcorr: -0.023914928 hartree
energy: -1079.776017759160
dipole: 20.01818 -19.90519 0.11298 12.60229 -12.49597 0.10633 -7.62201 6.73829 -0.88371
magnitude: 0.89723 au
magnitude: 2.28058 debye
