program: Orca
programVersion: 5.0.2
elementType: O O O C C C C C C C C C C C C C C C C C C C C C C H H H H H H H H H H H H H H H H H H H H H H H H H H
charge: 0
multiplicity: 1
keywords: wb97x-d3
keywords: def2-TZVPP
keywords: def2/J RIJCOSX
keywords: DEFGRID2
keywords: scfconv7
keywords: smallprint printgap noloewdin
keywords: NOSOSCF
formula: C22H26O3
InChI: InChI=1/C22H26O3/c1-15(2)10-19-20(22(19,3)4)21(23)25-14-17-12-18(24-13-17)11-16-8-6-5-7-9-16/h5-10,12-13,19-20H,11,14H2,1-4H3
51 atoms
O  1.827436 -2.146821 -0.910445
O  2.26721 -1.695072 1.235889
O  -2.539088 -2.393953 -0.73982
C  4.135585 0.54578 0.077773
C  2.792624 1.113404 0.370538
C  2.904211 -0.149147 -0.477614
C  4.996394 1.222886 -0.961993
C  4.935888 -0.075707 1.195519
C  2.269065 2.363883 -0.231038
C  2.329248 -1.390639 0.066302
C  0.97519 2.547095 -0.509745
C  0.457331 3.839533 -1.057835
C  -0.041762 1.464844 -0.272703
C  1.003579 -3.269808 -0.553543
C  -0.401195 -2.829908 -0.336983
C  -0.96131 -2.142103 0.790641
C  -1.412483 -2.947497 -1.229213
C  -2.258878 -1.899372 0.489842
C  -3.34774 -1.188518 1.212445
C  -3.49295 0.253713 0.780267
C  -3.939406 0.578005 -0.49987
C  -3.165435 1.286357 1.653337
C  -4.047533 1.902876 -0.896828
C  -3.277193 2.614105 1.260068
C  -3.714903 2.92677 -0.018388
H  2.430216 0.908064 1.37612
H  2.748272 -0.014918 -1.541952
H  5.715278 0.517931 -1.384022
H  5.56321 2.043924 -0.517589
H  4.412499 1.630962 -1.787569
H  5.593962 0.676586 1.635688
H  5.568165 -0.884442 0.823174
H  4.317321 -0.474588 1.996079
H  2.972287 3.172432 -0.409968
H  -0.29151 4.273259 -0.388893
H  1.248215 4.576049 -1.20122
H  -0.043124 3.685869 -2.017615
H  -0.159238 1.249836 0.79197
H  -1.022451 1.742649 -0.658697
H  0.242317 0.526196 -0.752768
H  1.409765 -3.787518 0.315652
H  1.063292 -3.946762 -1.404642
H  -0.462302 -1.863767 1.704967
H  -1.474132 -3.395321 -2.209381
H  -3.126933 -1.227658 2.279748
H  -4.292954 -1.719922 1.069599
H  -4.210768 -0.207572 -1.195108
H  -2.81697 1.051901 2.65253
H  -4.394651 2.136485 -1.895541
H  -3.018888 3.403756 1.954334
H  -3.800283 3.960357 -0.328927
elementType: O C H
totalener: -1079.75061476 hartree
nucrepener: 2208.46066828 hartree
electener: -3288.21128304 hartree
oneelecener: -5856.30650832 hartree
twoeener: 2568.09522528 hartree
cpcmener: -0.02274743 hartree
kineticenergy: 1074.85517817 hartree
xcener: -106.461249001097 hartree
chargesum: 0.0000000
charge: -0.287086 -0.479625 -0.278209 0.160756 0.010730 -0.115099 -0.287363 -0.280325 -0.345967 0.391887 0.063985 -0.233993 -0.304514 0.070825 -0.061892 -0.359181 -0.037410 0.251738 -0.052554 0.037651 -0.189967 -0.223320 -0.133522 -0.116309 -0.198396 0.101211 0.096383 0.097438 0.098989 0.091763 0.092913 0.097692 0.093010 0.120618 0.095577 0.090498 0.099008 0.108034 0.085039 0.106399 0.116864 0.117276 0.160180 0.173274 0.100058 0.115994 0.136080 0.137412 0.154922 0.155143 0.155385
qa: -0.2871 -0.4796 -0.2782 0.1608 0.0107 -0.1151 -0.2874 -0.2803 -0.3460 0.3919 0.0640 -0.2340 -0.3045 0.0708 -0.0619 -0.3592 -0.0374 0.2517 -0.0526 0.0377 -0.1900 -0.2233 -0.1335 -0.1163 -0.1984 0.1012 0.0964 0.0974 0.0990 0.0918 0.0929 0.0977 0.0930 0.1206 0.0956 0.0905 0.0990 0.1080 0.0850 0.1064 0.1169 0.1173 0.1602 0.1733 0.1001 0.1160 0.1361 0.1374 0.1549 0.1551 0.1554
va: 2.1019 2.0201 2.2771 3.7150 3.7925 3.8142 3.9094 3.8841 3.9023 4.1456 3.6434 3.9171 3.9730 3.8550 3.6475 3.9621 3.9704 3.5793 3.8049 3.6079 3.9372 3.9040 3.8706 3.8219 3.8841 1.0282 1.0325 1.0032 0.9997 1.0023 1.0009 0.9994 1.0205 1.0046 0.9947 1.0095 0.9940 0.9914 1.0149 1.0032 1.0112 0.9971 1.0207 0.9949 1.0134 1.0062 1.0173 1.0055 0.9916 0.9908 0.9923
dispcorr: -0.028098019 hartree
energy: -1079.778712777642
dipole: 13.31786 -13.60930 -0.29144 16.84948 -16.50494 0.34454 -1.21222 0.53739 -0.67483
magnitude: 0.81181 au
magnitude: 2.06347 debye
