program: Orca
programVersion: 5.0.2
elementType: O O O C C C C C C C C C C C C C C C C C C C C C C H H H H H H H H H H H H H H H H H H H H H H H H H H
charge: 0
multiplicity: 1
keywords: wb97x-d3
keywords: def2-TZVPP
keywords: def2/J RIJCOSX
keywords: DEFGRID2
keywords: scfconv7
keywords: smallprint printgap noloewdin
keywords: NOSOSCF
formula: C22H26O3
InChI: InChI=1/C22H26O3/c1-15(2)10-19-20(22(19,3)4)21(23)25-14-17-12-18(24-13-17)11-16-8-6-5-7-9-16/h5-10,12-13,19-20H,11,14H2,1-4H3
51 atoms
O  1.591845 -1.847922 0.411515
O  1.401186 -1.278154 -1.742066
O  -2.719944 -2.158783 -0.365542
C  2.049721 1.561356 -0.541617
C  3.252854 1.012924 -1.249678
C  2.549779 0.162841 -0.214732
C  2.240563 2.596345 0.540592
C  0.779683 1.761759 -1.330841
C  4.620242 1.50313 -0.971852
C  1.795865 -1.036837 -0.624941
C  5.45903 2.04912 -1.858184
C  6.821133 2.516315 -1.440725
C  5.143329 2.263877 -3.306759
C  0.79366 -3.023554 0.195539
C  -0.657365 -2.701379 0.242563
C  -1.46883 -2.554068 1.41393
C  -1.477629 -2.444539 -0.803698
C  -2.710423 -2.226992 0.986838
C  -3.974026 -1.908198 1.698147
C  -4.311453 -0.4372 1.626106
C  -3.574296 0.485095 2.365758
C  -5.339443 0.024279 0.812268
C  -3.864047 1.839264 2.298812
C  -5.63141 1.381372 0.741454
C  -4.895135 2.292084 1.484315
H  3.058561 0.713147 -2.274098
H  3.041235 0.074805 0.748282
H  2.364856 3.58932 0.1031
H  3.110693 2.40013 1.165989
H  1.366938 2.630816 1.194743
H  0.690272 1.091675 -2.182945
H  0.749828 2.782469 -1.718026
H  -0.102719 1.626125 -0.701427
H  4.960329 1.413249 0.056053
H  7.604311 2.006488 -2.008408
H  6.946484 3.584809 -1.636169
H  7.010049 2.345097 -0.380847
H  5.192181 3.327783 -3.553745
H  5.881461 1.768595 -3.942738
H  4.158472 1.906345 -3.600487
H  1.065195 -3.693767 1.009755
H  1.067752 -3.50842 -0.741893
H  -1.161249 -2.681464 2.440433
H  -1.32541 -2.438985 -1.871632
H  -3.856638 -2.214615 2.739047
H  -4.797105 -2.499041 1.287783
H  -2.766687 0.139258 3.001217
H  -5.921266 -0.681412 0.230959
H  -3.286017 2.542779 2.884714
H  -6.43709 1.725314 0.105254
H  -5.123677 3.348902 1.432359
elementType: O C H
totalener: -1079.75503514 hartree
nucrepener: 2084.41938004 hartree
electener: -3164.17441518 hartree
oneelecener: -5608.26734354 hartree
twoeener: 2444.09292836 hartree
cpcmener: -0.02519265 hartree
kineticenergy: 1074.86694222 hartree
xcener: -106.461586653259 hartree
chargesum: -0.0000000
charge: -0.283770 -0.474267 -0.276901 0.123830 0.031338 -0.119878 -0.263247 -0.282679 -0.275244 0.400193 -0.042064 -0.221362 -0.251336 0.088223 -0.083918 -0.329491 -0.015242 0.203721 -0.064286 0.043643 -0.194196 -0.188391 -0.160466 -0.154681 -0.169122 0.091180 0.088106 0.096337 0.086871 0.097433 0.092419 0.095619 0.097512 0.117770 0.093109 0.092839 0.087592 0.095217 0.095290 0.089240 0.118137 0.118656 0.161038 0.169158 0.117324 0.108115 0.141745 0.138684 0.156278 0.156309 0.157614
qa: -0.2838 -0.4743 -0.2769 0.1238 0.0313 -0.1199 -0.2632 -0.2827 -0.2752 0.4002 -0.0421 -0.2214 -0.2513 0.0882 -0.0839 -0.3295 -0.0152 0.2037 -0.0643 0.0436 -0.1942 -0.1884 -0.1605 -0.1547 -0.1691 0.0912 0.0881 0.0963 0.0869 0.0974 0.0924 0.0956 0.0975 0.1178 0.0931 0.0928 0.0876 0.0952 0.0953 0.0892 0.1181 0.1187 0.1610 0.1692 0.1173 0.1081 0.1417 0.1387 0.1563 0.1563 0.1576
va: 2.1253 2.0311 2.2801 3.6827 3.7669 3.8809 3.9041 3.9054 3.8695 4.1826 3.7465 3.9233 3.9436 3.8186 3.6330 4.0132 3.9469 3.6236 3.8215 3.5935 3.9393 3.9537 3.9101 3.8970 3.8993 1.0326 1.0381 1.0027 1.0055 1.0025 1.0195 1.0011 0.9999 1.0094 0.9961 0.9963 1.0088 0.9974 0.9973 1.0097 0.9944 1.0112 1.0068 1.0057 1.0061 1.0096 1.0038 1.0048 0.9915 0.9912 0.9904
dispcorr: -0.022365203 hartree
energy: -1079.777400338692
dipole: 22.09717 -21.86386 0.23331 20.02158 -19.74459 0.27699 -5.23162 6.25398 1.02237
magnitude: 1.08462 au
magnitude: 2.75688 debye
