program: Orca
programVersion: 5.0.2
elementType: O O O C C C C C C C C C C C C C C C C C C C C C C H H H H H H H H H H H H H H H H H H H H H H H H H H
charge: 0
multiplicity: 1
keywords: wb97x-d3
keywords: def2-TZVPP
keywords: def2/J RIJCOSX
keywords: DEFGRID2
keywords: scfconv7
keywords: smallprint printgap noloewdin
keywords: NOSOSCF
formula: C22H26O3
InChI: InChI=1/C22H26O3/c1-15(2)10-19-20(22(19,3)4)21(23)25-14-17-12-18(24-13-17)11-16-8-6-5-7-9-16/h5-10,12-13,19-20H,11,14H2,1-4H3
51 atoms
O  1.516086 -0.069044 1.202252
O  1.888984 -1.382573 -0.568082
O  -2.483445 -0.108002 -0.052424
C  2.904512 1.295484 -1.833225
C  4.081997 0.480522 -1.390395
C  2.956638 0.754217 -0.412767
C  3.046194 2.792209 -1.967914
C  1.962584 0.703511 -2.853088
C  5.412309 1.074668 -1.145079
C  2.085161 -0.350128 0.025994
C  6.567186 0.682118 -1.692162
C  7.850752 1.382621 -1.361092
C  6.708158 -0.443569 -2.67048
C  0.588948 -1.01172 1.735198
C  -0.748662 -0.885911 1.09108
C  -1.845036 -1.797288 1.222868
C  -1.198474 0.119849 0.30632
C  -2.869992 -1.27323 0.508712
C  -4.275946 -1.703807 0.290448
C  -5.249779 -0.842131 1.059176
C  -5.714248 0.357643 0.526531
C  -5.66825 -1.21685 2.332524
C  -6.577857 1.166088 1.252703
C  -6.535303 -0.412552 3.05916
C  -6.991816 0.783196 2.521488
H  4.082866 -0.531348 -1.78183
H  3.153606 1.501175 0.348751
H  3.488179 3.047977 -2.933355
H  3.669621 3.233888 -1.191438
H  2.067733 3.274217 -1.915868
H  0.935437 1.034771 -2.685021
H  1.96785 -0.383882 -2.864625
H  2.252952 1.039515 -3.850654
H  5.440839 1.913249 -0.454638
H  7.707644 2.194444 -0.647975
H  8.580668 0.687577 -0.937285
H  8.311839 1.802008 -2.259447
H  7.427232 -1.182751 -2.308108
H  5.776044 -0.963597 -2.88228
H  7.100714 -0.074663 -3.621776
H  0.524812 -0.77625 2.798628
H  0.971006 -2.031823 1.654646
H  -1.862417 -2.721308 1.779945
H  -0.746174 1.021856 -0.075206
H  -4.364143 -2.743387 0.608391
H  -4.513369 -1.677344 -0.776656
H  -5.403562 0.662076 -0.466179
H  -5.314624 -2.147979 2.760325
H  -6.930043 2.096212 0.824752
H  -6.854665 -0.720577 4.0468
H  -7.668398 1.411489 3.086569
elementType: O C H
totalener: -1079.75426912 hartree
nucrepener: 2031.44137820 hartree
electener: -3111.19564732 hartree
oneelecener: -5502.09949778 hartree
twoeener: 2390.90385046 hartree
cpcmener: -0.02716860 hartree
kineticenergy: 1074.85521185 hartree
xcener: -106.462158827106 hartree
chargesum: 0.0000000
charge: -0.293268 -0.464320 -0.283721 0.115470 0.029211 -0.091954 -0.265798 -0.277469 -0.275683 0.369843 -0.046051 -0.218960 -0.250511 0.107045 -0.025663 -0.351461 -0.058568 0.213082 -0.065908 0.067432 -0.202087 -0.204161 -0.152709 -0.147430 -0.176314 0.093812 0.087649 0.096591 0.087184 0.097343 0.094545 0.094739 0.096176 0.117766 0.088066 0.093002 0.092596 0.094438 0.089887 0.095862 0.121066 0.113697 0.159609 0.167537 0.106480 0.115949 0.138374 0.139109 0.155664 0.155889 0.156922
qa: -0.2933 -0.4643 -0.2837 0.1155 0.0292 -0.0920 -0.2658 -0.2775 -0.2757 0.3698 -0.0461 -0.2190 -0.2505 0.1070 -0.0257 -0.3515 -0.0586 0.2131 -0.0659 0.0674 -0.2021 -0.2042 -0.1527 -0.1474 -0.1763 0.0938 0.0876 0.0966 0.0872 0.0973 0.0945 0.0947 0.0962 0.1178 0.0881 0.0930 0.0926 0.0944 0.0899 0.0959 0.1211 0.1137 0.1596 0.1675 0.1065 0.1159 0.1384 0.1391 0.1557 0.1559 0.1569
va: 2.1201 2.0335 2.2732 3.6805 3.7909 3.8507 3.9081 3.8978 3.8716 4.1889 3.7567 3.9221 3.9424 3.8259 3.6186 4.0182 3.9529 3.6253 3.8269 3.5726 3.9615 3.9487 3.8974 3.8896 3.9041 1.0322 1.0377 1.0023 1.0057 1.0021 1.0018 1.0186 1.0015 1.0100 1.0087 0.9965 0.9962 0.9974 1.0099 0.9972 0.9903 1.0125 1.0059 0.9985 1.0107 1.0062 1.0106 1.0044 0.9911 0.9910 0.9907
dispcorr: -0.022070672 hartree
energy: -1079.776339792122
dipole: 27.78399 -27.51688 0.26711 8.10210 -7.62737 0.47472 -13.08255 13.46036 0.37781
magnitude: 0.66291 au
magnitude: 1.68499 debye
