program: Orca
programVersion: 5.0.2
elementType: O O O C C C C C C C C C C C C C C C C C C C C C C H H H H H H H H H H H H H H H H H H H H H H H H H H
charge: 0
multiplicity: 1
keywords: wb97x-d3
keywords: def2-TZVPP
keywords: def2/J RIJCOSX
keywords: DEFGRID2
keywords: scfconv7
keywords: smallprint printgap noloewdin
keywords: NOSOSCF
formula: C22H26O3
InChI: InChI=1/C22H26O3/c1-15(2)10-19-20(22(19,3)4)21(23)25-14-17-12-18(24-13-17)11-16-8-6-5-7-9-16/h5-10,12-13,19-20H,11,14H2,1-4H3
51 atoms
O  1.853009 -2.045198 -0.231193
O  2.185004 -0.674518 1.504711
O  -2.472809 -1.327985 -0.847964
C  4.772906 0.210873 0.002494
C  3.6542 1.086432 -0.437723
C  3.488473 -0.433105 -0.488407
C  5.959108 0.02703 -0.914237
C  5.15266 0.18136 1.463151
C  3.657602 1.869398 -1.695612
C  2.471434 -1.037995 0.38678
C  2.538879 2.288892 -2.293919
C  2.573003 3.121434 -3.536906
C  1.178466 1.960328 -1.744785
C  0.705131 -2.632355 0.402119
C  -0.526265 -1.864551 0.075237
C  -0.902172 -0.547086 0.502354
C  -1.521467 -2.277865 -0.743577
C  -2.087109 -0.273924 -0.091278
C  -3.005935 0.890932 -0.018084
C  -4.231651 0.582486 0.808221
C  -4.17728 0.668794 2.197098
C  -5.41706 0.172079 0.207269
C  -5.285795 0.35622 2.96989
C  -6.528624 -0.143153 0.97869
C  -6.465871 -0.053802 2.362078
H  3.092687 1.537915 0.377395
H  3.547388 -0.874783 -1.476489
H  6.483661 -0.900952 -0.6783
H  6.671017 0.846376 -0.793409
H  5.677293 -0.015835 -1.966528
H  4.331824 0.441811 2.126492
H  5.956458 0.898463 1.642494
H  5.523674 -0.803442 1.754184
H  4.618877 2.131383 -2.127887
H  2.061517 4.075806 -3.383659
H  3.590917 3.334009 -3.864146
H  2.050653 2.622052 -4.357285
H  1.097424 0.912489 -1.449624
H  0.947707 2.556766 -0.857759
H  0.392459 2.157776 -2.474354
H  0.861182 -2.714625 1.478381
H  0.639689 -3.641335 -0.003063
H  -0.365293 0.110046 1.16703
H  -1.676854 -3.188829 -1.301261
H  -3.298982 1.202224 -1.024245
H  -2.455329 1.723259 0.422759
H  -3.258754 0.985727 2.678063
H  -5.475405 0.101386 -0.872657
H  -5.228578 0.432829 4.048392
H  -7.444322 -0.461752 0.496721
H  -7.332152 -0.297176 2.963871
elementType: O C H
totalener: -1079.75168831 hartree
nucrepener: 2106.56659006 hartree
electener: -3186.31827837 hartree
oneelecener: -5652.31850686 hartree
twoeener: 2466.00022849 hartree
cpcmener: -0.02407068 hartree
kineticenergy: 1074.86287718 hartree
xcener: -106.460468481419 hartree
chargesum: 0.0000000
charge: -0.287767 -0.480685 -0.279727 0.169355 -0.034909 -0.092272 -0.292653 -0.279161 -0.297701 0.394071 0.019868 -0.225656 -0.284530 0.074647 -0.058471 -0.369977 -0.041976 0.237167 -0.053449 0.054299 -0.198457 -0.198603 -0.158745 -0.156510 -0.169789 0.102188 0.091299 0.098143 0.100102 0.089913 0.093084 0.092209 0.098656 0.124451 0.099433 0.085805 0.095522 0.085281 0.107810 0.100704 0.116641 0.116089 0.162827 0.174252 0.112753 0.112571 0.142319 0.139349 0.156685 0.155881 0.157662
qa: -0.2878 -0.4807 -0.2797 0.1694 -0.0349 -0.0923 -0.2927 -0.2792 -0.2977 0.3941 0.0199 -0.2257 -0.2845 0.0746 -0.0585 -0.3700 -0.0420 0.2372 -0.0534 0.0543 -0.1985 -0.1986 -0.1587 -0.1565 -0.1698 0.1022 0.0913 0.0981 0.1001 0.0899 0.0931 0.0922 0.0987 0.1245 0.0994 0.0858 0.0955 0.0853 0.1078 0.1007 0.1166 0.1161 0.1628 0.1743 0.1128 0.1126 0.1423 0.1393 0.1567 0.1559 0.1577
va: 2.1070 2.0157 2.2819 3.7050 3.8320 3.8270 3.9153 3.8784 3.8568 4.1298 3.6806 3.9262 3.9605 3.8560 3.6626 3.9934 3.9775 3.6146 3.8018 3.5871 3.9427 3.9611 3.9047 3.8993 3.8985 1.0232 1.0340 1.0028 0.9990 1.0019 1.0207 1.0010 0.9991 1.0039 0.9931 1.0082 0.9941 0.9967 0.9956 1.0064 1.0102 0.9976 1.0209 0.9947 1.0089 1.0102 1.0038 1.0067 0.9912 0.9913 0.9904
dispcorr: -0.024162658 hartree
energy: -1079.775850972630
dipole: 19.86259 -19.75589 0.10671 12.41347 -12.31459 0.09888 -7.29299 6.40926 -0.88372
magnitude: 0.89561 au
magnitude: 2.27647 debye
