program: Orca
programVersion: 5.0.2
elementType: O O O C C C C C C C C C C C C C C C C C C C C C C H H H H H H H H H H H H H H H H H H H H H H H H H H
charge: 0
multiplicity: 1
keywords: wb97x-d3
keywords: def2-TZVPP
keywords: def2/J RIJCOSX
keywords: DEFGRID2
keywords: scfconv7
keywords: smallprint printgap noloewdin
keywords: NOSOSCF
formula: C22H26O3
InChI: InChI=1/C22H26O3/c1-15(2)10-19-20(22(19,3)4)21(23)25-14-17-12-18(24-13-17)11-16-8-6-5-7-9-16/h5-10,12-13,19-20H,11,14H2,1-4H3
51 atoms
O  1.91241 -2.243785 -0.79236
O  1.91029 -1.69007 1.373902
O  -2.299579 -2.025339 -1.049244
C  3.548731 0.826734 0.5110
C  2.101133 1.146041 0.357413
C  2.664438 -0.122314 -0.273091
C  4.548214 1.587154 -0.328601
C  4.083687 0.459723 1.873515
C  1.60636 2.25077 -0.503608
C  2.148518 -1.409542 0.222156
C  0.57466 2.167104 -1.348265
C  0.149268 3.340029 -2.177046
C  -0.226894 0.916972 -1.552985
C  1.0548 -3.375489 -0.550855
C  -0.354068 -2.906377 -0.446021
C  -1.066028 -2.494659 0.72702
C  -1.162014 -2.597939 -1.488805
C  -2.234901 -1.96037 0.30242
C  -3.319804 -1.229178 1.006875
C  -3.104747 0.265055 0.907781
C  -2.079421 0.869451 1.63317
C  -3.879188 1.050927 0.062562
C  -1.835901 2.229208 1.519129
C  -3.638026 2.415506 -0.054126
C  -2.615717 3.008394 0.672103
H  1.507475 0.954622 1.249714
H  2.793407 -0.082599 -1.348653
H  5.466245 1.008434 -0.448825
H  4.815525 2.532255 0.148879
H  4.170693 1.814678 -1.325919
H  3.333682 0.018184 2.524945
H  4.458914 1.357642 2.369267
H  4.917212 -0.241358 1.794805
H  2.124997 3.2019 -0.412097
H  0.176587 3.09598 -3.242691
H  -0.882983 3.622879 -1.953285
H  0.781577 4.213202 -2.016007
H  -1.292207 1.149783 -1.613989
H  0.037653 0.435647 -2.499361
H  -0.090993 0.186942 -0.758392
H  1.372526 -3.929635 0.332682
H  1.19553 -4.01642 -1.419441
H  -0.739874 -2.574859 1.751631
H  -1.057393 -2.721393 -2.556112
H  -3.316756 -1.53921 2.053297
H  -4.295838 -1.49861 0.596766
H  -1.461537 0.268805 2.291536
H  -4.678731 0.596482 -0.510812
H  -1.03642 2.682519 2.091721
H  -4.250478 3.014661 -0.716186
H  -2.426563 4.070525 0.582062
elementType: O C H
totalener: -1079.74970462 hartree
nucrepener: 2281.21782930 hartree
electener: -3360.96753391 hartree
oneelecener: -6002.03717920 hartree
twoeener: 2641.06964529 hartree
cpcmener: -0.02321489 hartree
kineticenergy: 1074.86469479 hartree
xcener: -106.464234579852 hartree
chargesum: -0.0000000
charge: -0.287103 -0.471209 -0.270106 0.161093 -0.001500 -0.092242 -0.287371 -0.288131 -0.299599 0.364424 -0.013446 -0.224036 -0.212045 0.075102 -0.069649 -0.289318 -0.053684 0.188533 -0.054339 0.059523 -0.204578 -0.195835 -0.145434 -0.128341 -0.199681 0.097937 0.091754 0.097820 0.098381 0.092362 0.092536 0.092364 0.098297 0.118804 0.099965 0.089882 0.089619 0.102164 0.122620 0.022168 0.116055 0.121162 0.157120 0.172633 0.115582 0.106090 0.137835 0.137189 0.155508 0.154385 0.158740
qa: -0.2871 -0.4712 -0.2701 0.1611 -0.0015 -0.0922 -0.2874 -0.2881 -0.2996 0.3644 -0.0134 -0.2240 -0.2120 0.0751 -0.0696 -0.2893 -0.0537 0.1885 -0.0543 0.0595 -0.2046 -0.1958 -0.1454 -0.1283 -0.1997 0.0979 0.0918 0.0978 0.0984 0.0924 0.0925 0.0924 0.0983 0.1188 0.1000 0.0899 0.0896 0.1022 0.1226 0.0222 0.1161 0.1212 0.1571 0.1726 0.1156 0.1061 0.1378 0.1372 0.1555 0.1544 0.1587
va: 2.1068 2.0278 2.2630 3.7201 3.7839 3.8117 3.9055 3.8821 3.8540 4.1880 3.7228 3.9266 3.9159 3.8558 3.6389 3.9666 3.9243 3.6393 3.8221 3.5654 3.8736 3.9429 3.8307 3.8523 3.8585 1.0240 1.0319 1.0030 1.0005 1.0025 1.0216 1.0007 0.9992 1.0055 0.9962 0.9976 1.0069 1.0007 1.0036 1.0139 1.0082 0.9958 1.0165 0.9948 1.0078 1.0141 1.0071 1.0053 0.9922 0.9910 0.9904
dispcorr: -0.031221435 hartree
energy: -1079.780926051307
dipole: 10.95459 -11.13358 -0.17900 16.46244 -16.15523 0.30721 -3.02210 2.19295 -0.82915
magnitude: 0.90217 au
magnitude: 2.29314 debye
