program: Orca
programVersion: 5.0.2
elementType: O O O C C C C C C C C C C C C C C C C C C C C C C H H H H H H H H H H H H H H H H H H H H H H H H H H
charge: 0
multiplicity: 1
keywords: wb97x-d3
keywords: def2-TZVPP
keywords: def2/J RIJCOSX
keywords: DEFGRID2
keywords: scfconv7
keywords: smallprint printgap noloewdin
keywords: NOSOSCF
formula: C22H26O3
InChI: InChI=1/C22H26O3/c1-15(2)10-19-20(22(19,3)4)21(23)25-14-17-12-18(24-13-17)11-16-8-6-5-7-9-16/h5-10,12-13,19-20H,11,14H2,1-4H3
51 atoms
O  1.814296 -2.117439 -0.657912
O  2.290119 -1.541122 1.454141
O  -2.528358 -2.744128 -0.747771
C  4.136361 0.599615 -0.013878
C  2.877657 1.207802 0.491732
C  2.804724 -0.055717 -0.351369
C  4.84496 1.238029 -1.183824
C  5.076013 -0.055845 0.967308
C  2.27922 2.459367 -0.035409
C  2.303476 -1.293349 0.269636
C  0.960936 2.676888 -0.038975
C  0.360004 3.932155 -0.588693
C  -0.011179 1.649819 0.465446
C  1.054595 -3.264957 -0.246806
C  -0.3890 -2.912686 -0.186653
C  -1.052904 -2.055371 0.750317
C  -1.340871 -3.294457 -1.069933
C  -2.346955 -1.982612 0.357903
C  -3.512093 -1.21121 0.868949
C  -3.532782 0.227542 0.400284
C  -3.763231 1.25679 1.307977
C  -3.329677 0.554517 -0.939514
C  -3.793812 2.581751 0.891006
C  -3.35249 1.876786 -1.357507
C  -3.585157 2.89711 -0.44369
H  2.689986 1.021237 1.54707
H  2.486903 0.081188 -1.378885
H  5.505773 2.038341 -0.843721
H  4.15402 1.664953 -1.911237
H  5.460688 0.50394 -1.707386
H  5.627259 -0.87235 0.496208
H  4.566682 -0.454935 1.842067
H  5.80855 0.672753 1.32061
H  2.947549 3.221057 -0.426687
H  -0.338047 3.704688 -1.399373
H  -0.218932 4.459131 0.174426
H  1.113877 4.617865 -0.97619
H  -0.276196 0.944213 -0.327222
H  0.386941 1.065507 1.295158
H  -0.940069 2.11232 0.801098
H  1.422172 -3.655166 0.70227
H  1.231085 -4.021538 -1.010495
H  -0.62096 -1.55493 1.602708
H  -1.318002 -3.936511 -1.937204
H  -3.494257 -1.231649 1.959821
H  -4.43782 -1.710969 0.56941
H  -3.917551 1.021814 2.35483
H  -3.149579 -0.225963 -1.66927
H  -3.972778 3.367727 1.61393
H  -3.188119 2.111426 -2.401724
H  -3.601655 3.929027 -0.770472
elementType: O C H
totalener: -1079.75044597 hartree
nucrepener: 2204.35944807 hartree
electener: -3284.10989403 hartree
oneelecener: -5847.95138323 hartree
twoeener: 2563.84148919 hartree
cpcmener: -0.02302905 hartree
kineticenergy: 1074.85644435 hartree
xcener: -106.462234605647 hartree
chargesum: -0.0000000
charge: -0.284472 -0.479545 -0.277087 0.154954 0.000591 -0.089586 -0.285542 -0.277009 -0.327654 0.379535 0.071299 -0.248659 -0.323694 0.072547 -0.057828 -0.356827 -0.039164 0.250868 -0.028493 0.008001 -0.183537 -0.213829 -0.129500 -0.124505 -0.198481 0.096800 0.090684 0.098847 0.090842 0.097342 0.098021 0.090748 0.093634 0.121536 0.094066 0.096828 0.095035 0.110350 0.102361 0.096055 0.116610 0.115127 0.161574 0.173896 0.102085 0.107735 0.135816 0.136611 0.154121 0.155334 0.155563
qa: -0.2845 -0.4795 -0.2771 0.1550 0.0006 -0.0896 -0.2855 -0.2770 -0.3277 0.3795 0.0713 -0.2487 -0.3237 0.0725 -0.0578 -0.3568 -0.0392 0.2509 -0.0285 0.0080 -0.1835 -0.2138 -0.1295 -0.1245 -0.1985 0.0968 0.0907 0.0988 0.0908 0.0973 0.0980 0.0907 0.0936 0.1215 0.0941 0.0968 0.0950 0.1103 0.1024 0.0961 0.1166 0.1151 0.1616 0.1739 0.1021 0.1077 0.1358 0.1366 0.1541 0.1553 0.1556
va: 2.1103 2.0205 2.2740 3.7244 3.8006 3.7948 3.9071 3.8897 3.9030 4.1711 3.6188 3.9319 3.9764 3.8490 3.6772 3.9658 3.9580 3.5946 3.7958 3.6632 3.9204 3.8793 3.8494 3.8315 3.8754 1.0289 1.0359 0.9993 1.0017 1.0030 0.9996 1.0187 1.0011 1.0047 0.9951 0.9948 1.0100 0.9885 1.0108 1.0078 1.0132 0.9974 1.0150 0.9942 1.0091 1.0091 1.0046 1.0162 0.9919 0.9919 0.9925
dispcorr: -0.028176817 hartree
energy: -1079.778622783680
dipole: 13.12795 -13.45342 -0.32547 17.53597 -17.23662 0.29936 -0.74345 -0.00494 -0.74839
magnitude: 0.86927 au
magnitude: 2.20951 debye
