program: Orca
programVersion: 5.0.2
elementType: O O O C C C C C C C C C C C C C C C C C C C C C C H H H H H H H H H H H H H H H H H H H H H H H H H H
charge: 0
multiplicity: 1
keywords: wb97x-d3
keywords: def2-TZVPP
keywords: def2/J RIJCOSX
keywords: DEFGRID2
keywords: scfconv7
keywords: smallprint printgap noloewdin
keywords: NOSOSCF
formula: C22H26O3
InChI: InChI=1/C22H26O3/c1-15(2)10-19-20(22(19,3)4)21(23)25-14-17-12-18(24-13-17)11-16-8-6-5-7-9-16/h5-10,12-13,19-20H,11,14H2,1-4H3
51 atoms
O  1.532158 -1.762385 -0.975586
O  2.341285 -1.962843 1.097243
O  -1.984889 -2.62448 1.47053
C  1.785368 1.268069 -0.148434
C  2.646917 0.88067 -1.317977
C  2.708325 0.062877 -0.054399
C  2.175322 2.468132 0.677711
C  0.290826 1.076743 -0.249127
C  3.838931 1.674132 -1.710453
C  2.183206 -1.310539 0.090834
C  3.885339 2.554209 -2.714361
C  5.147694 3.293253 -3.040417
C  2.712137 2.882752 -3.585825
C  0.817722 -3.005177 -0.850622
C  -0.468794 -2.791592 -0.138228
C  -1.657742 -2.198108 -0.674224
C  -0.733922 -3.025132 1.168367
C  -2.543266 -2.117829 0.345516
C  -3.89963 -1.523374 0.462887
C  -3.845196 -0.185677 1.163531
C  -3.445786 0.951933 0.465672
C  -4.141281 -0.072484 2.517635
C  -3.348342 2.17808 1.106794
C  -4.04308 1.154146 3.16308
C  -3.64628 2.282644 2.459887
H  2.100629 0.427889 -2.139456
H  3.578388 0.223379 0.57454
H  1.817479 3.387054 0.20766
H  3.254109 2.561207 0.801051
H  1.731186 2.412372 1.673728
H  -0.139768 0.809434 0.718451
H  0.003656 0.311527 -0.967509
H  -0.178916 2.009593 -0.5688
H  4.741033 1.518456 -1.125052
H  5.969604 3.016028 -2.380078
H  5.46386 3.098708 -4.068952
H  5.002666 4.374136 -2.962459
H  2.929634 2.660956 -4.634185
H  1.805731 2.345092 -3.311564
H  2.488059 3.951918 -3.53946
H  1.433808 -3.758437 -0.359062
H  0.648304 -3.327539 -1.876777
H  -1.821718 -1.868591 -1.68874
H  -0.155264 -3.459517 1.968638
H  -4.568548 -2.20232 0.997696
H  -4.304494 -1.40462 -0.543334
H  -3.205532 0.876946 -0.589107
H  -4.454369 -0.948555 3.073629
H  -3.039607 3.053568 0.549405
H  -4.27788 1.227191 4.217528
H  -3.570527 3.238838 2.961738
elementType: O C H
totalener: -1079.75186443 hartree
nucrepener: 2157.54887550 hartree
electener: -3237.30073993 hartree
oneelecener: -5754.20681673 hartree
twoeener: 2516.90607681 hartree
cpcmener: -0.02634456 hartree
kineticenergy: 1074.86359950 hartree
xcener: -106.461286523820 hartree
chargesum: -0.0000000
charge: -0.274170 -0.467927 -0.275852 0.189608 0.020876 -0.144693 -0.272814 -0.348340 -0.282832 0.402435 -0.031585 -0.230011 -0.251793 0.068230 -0.050003 -0.395900 -0.015060 0.233746 -0.055401 0.090150 -0.248221 -0.202288 -0.148112 -0.149923 -0.170251 0.101586 0.092524 0.094443 0.091339 0.099539 0.110772 0.096838 0.099412 0.118945 0.088876 0.094063 0.093593 0.098545 0.087154 0.095921 0.118895 0.117708 0.160458 0.171327 0.110408 0.114289 0.142560 0.139854 0.157629 0.156253 0.157201
qa: -0.2742 -0.4679 -0.2759 0.1896 0.0209 -0.1447 -0.2728 -0.3483 -0.2828 0.4024 -0.0316 -0.2300 -0.2518 0.0682 -0.0500 -0.3959 -0.0151 0.2337 -0.0554 0.0902 -0.2482 -0.2023 -0.1481 -0.1499 -0.1703 0.1016 0.0925 0.0944 0.0913 0.0995 0.1108 0.0968 0.0994 0.1189 0.0889 0.0941 0.0936 0.0985 0.0872 0.0959 0.1189 0.1177 0.1605 0.1713 0.1104 0.1143 0.1426 0.1399 0.1576 0.1563 0.1572
va: 2.1139 2.0325 2.2781 3.6535 3.7530 3.9018 3.8983 3.9087 3.8602 4.2072 3.7086 3.9287 3.9417 3.8389 3.6090 3.9870 3.9665 3.5840 3.8165 3.5367 3.9283 3.9693 3.8682 3.8942 3.9069 1.0185 1.0342 1.0024 1.0030 1.0026 0.9905 1.0088 1.0021 1.0084 1.0079 0.9955 0.9962 0.9981 1.0086 0.9975 1.0104 0.9952 1.0085 1.0031 1.0103 1.0083 1.0026 1.0058 0.9911 0.9907 0.9901
dispcorr: -0.025972772 hartree
energy: -1079.777837199130
dipole: 12.42014 -13.09945 -0.67930 22.83833 -22.00395 0.83438 -12.32723 10.96268 -1.36454
magnitude: 1.73771 au
magnitude: 4.41690 debye
