program: Orca
programVersion: 5.0.2
elementType: O O O C C C C C C C C C C C C C C C C C C C C C C H H H H H H H H H H H H H H H H H H H H H H H H H H
charge: 0
multiplicity: 1
keywords: wb97x-d3
keywords: def2-TZVPP
keywords: def2/J RIJCOSX
keywords: DEFGRID2
keywords: scfconv7
keywords: smallprint printgap noloewdin
keywords: NOSOSCF
formula: C22H26O3
InChI: InChI=1/C22H26O3/c1-15(2)10-19-20(22(19,3)4)21(23)25-14-17-12-18(24-13-17)11-16-8-6-5-7-9-16/h5-10,12-13,19-20H,11,14H2,1-4H3
51 atoms
O  1.819389 -2.012931 -0.383728
O  2.2502 -0.84783 1.476435
O  -2.47837 -1.090799 -0.796159
C  4.830402 0.104719 -0.000158
C  3.733128 1.051738 -0.330426
C  3.513683 -0.448551 -0.518092
C  5.988067 -0.024532 -0.961649
C  5.242919 -0.073163 1.440663
C  3.739773 1.94622 -1.512311
C  2.493671 -1.101571 0.318589
C  2.62022 2.353958 -2.116622
C  2.646776 3.289368 -3.283897
C  1.26665 1.889186 -1.65383
C  0.674474 -2.636301 0.221471
C  -0.543661 -1.806532 0.0249
C  -0.890629 -0.564457 0.653683
C  -1.548385 -2.065576 -0.844188
C  -2.068879 -0.175557 0.113771
C  -2.945571 0.99975 0.347578
C  -4.284866 0.607209 0.922681
C  -4.380326 0.171398 2.242462
C  -5.436485 0.649287 0.145246
C  -5.602571 -0.211685 2.773498
C  -6.663094 0.266356 0.674432
C  -6.749328 -0.16619 1.989568
H  3.20348 1.445312 0.535137
H  3.537573 -0.796189 -1.544576
H  6.725254 0.761672 -0.784928
H  5.679115 0.038976 -2.005362
H  6.49266 -0.983202 -0.826453
H  4.443628 0.138928 2.146084
H  6.066364 0.607352 1.667474
H  5.598579 -1.088573 1.626943
H  4.700246 2.29859 -1.877256
H  2.171255 2.837632 -4.15875
H  2.085783 4.202613 -3.06733
H  3.661595 3.575207 -3.561176
H  1.064595 2.190109 -0.622888
H  0.466367 2.295335 -2.272654
H  1.181507 0.800264 -1.684485
H  0.86147 -2.841761 1.27594
H  0.567928 -3.591829 -0.290623
H  -0.337508 -0.033163 1.411152
H  -1.726032 -2.877213 -1.533198
H  -3.090535 1.551964 -0.58522
H  -2.422346 1.671403 1.030599
H  -3.489879 0.132113 2.85989
H  -5.376568 0.987175 -0.882821
H  -5.661535 -0.543848 3.802331
H  -7.55118 0.306503 0.056448
H  -7.703912 -0.463892 2.404339
elementType: O C H
totalener: -1079.75166445 hartree
nucrepener: 2103.87878372 hartree
electener: -3183.63044817 hartree
oneelecener: -5646.95361463 hartree
twoeener: 2463.32316646 hartree
cpcmener: -0.02386893 hartree
kineticenergy: 1074.86235771 hartree
xcener: -106.460250836876 hartree
chargesum: -0.0000000
charge: -0.286051 -0.481227 -0.279974 0.164825 -0.006164 -0.113763 -0.289895 -0.279842 -0.319489 0.397021 0.039377 -0.231507 -0.295406 0.069988 -0.067891 -0.353390 -0.036458 0.225082 -0.046875 0.038902 -0.194726 -0.185987 -0.160495 -0.158137 -0.167014 0.103004 0.094851 0.099334 0.091067 0.096997 0.092885 0.092335 0.097935 0.121741 0.098052 0.099139 0.085807 0.101941 0.103265 0.096566 0.117183 0.116318 0.159665 0.174620 0.108533 0.116808 0.142665 0.138616 0.156607 0.155777 0.157383
qa: -0.2861 -0.4812 -0.2800 0.1648 -0.0062 -0.1138 -0.2899 -0.2798 -0.3195 0.3970 0.0394 -0.2315 -0.2954 0.0700 -0.0679 -0.3534 -0.0365 0.2251 -0.0469 0.0389 -0.1947 -0.1860 -0.1605 -0.1581 -0.1670 0.1030 0.0949 0.0993 0.0911 0.0970 0.0929 0.0923 0.0979 0.1217 0.0981 0.0991 0.0858 0.1019 0.1033 0.0966 0.1172 0.1163 0.1597 0.1746 0.1085 0.1168 0.1427 0.1386 0.1566 0.1558 0.1574
va: 2.1045 2.0173 2.2801 3.7119 3.8163 3.8165 3.9130 3.8800 3.8776 4.1339 3.6398 3.9263 3.9657 3.8574 3.6507 3.9825 3.9729 3.6215 3.8003 3.6049 3.9399 3.9492 3.9074 3.9004 3.8971 1.0249 1.0325 0.9991 1.0020 1.0034 1.0211 1.0008 0.9995 1.0041 0.9931 0.9928 1.0079 0.9960 1.0073 0.9976 1.0103 0.9977 1.0224 0.9946 1.0069 1.0070 1.0037 1.0049 0.9914 0.9915 0.9904
dispcorr: -0.024233435 hartree
energy: -1079.775897880367
dipole: 20.27133 -20.18551 0.08582 11.91220 -11.75903 0.15317 -6.85472 5.97474 -0.87998
magnitude: 0.89732 au
magnitude: 2.28081 debye
