program: Orca
programVersion: 5.0.2
elementType: O O O C C C C C C C C C C C C C C C C C C C C C C H H H H H H H H H H H H H H H H H H H H H H H H H H
charge: 0
multiplicity: 1
keywords: wb97x-d3
keywords: def2-TZVPP
keywords: def2/J RIJCOSX
keywords: DEFGRID2
keywords: scfconv7
keywords: smallprint printgap noloewdin
keywords: NOSOSCF
formula: C22H26O3
InChI: InChI=1/C22H26O3/c1-15(2)10-19-20(22(19,3)4)21(23)25-14-17-12-18(24-13-17)11-16-8-6-5-7-9-16/h5-10,12-13,19-20H,11,14H2,1-4H3
51 atoms
O  2.0812 -1.971344 0.482251
O  2.235827 -2.100222 -1.740562
O  -2.069426 -2.090107 -0.748043
C  3.952927 0.469688 0.313478
C  2.528622 0.898973 0.3399
C  2.983556 -0.129036 -0.691917
C  4.982773 1.394778 -0.292294
C  4.499975 -0.347545 1.458291
C  2.039442 2.224759 -0.108571
C  2.419223 -1.489195 -0.711184
C  0.798062 2.409204 -0.567872
C  0.293081 3.759219 -0.968241
C  -0.162644 1.259804 -0.706815
C  1.210752 -3.116286 0.514788
C  -0.192761 -2.685482 0.273025
C  -1.107695 -2.15725 1.241269
C  -0.838105 -2.612769 -0.915836
C  -2.231003 -1.815488 0.567984
C  -3.513083 -1.190252 0.98639
C  -3.579517 0.27159 0.611658
C  -3.128917 1.243936 1.500177
C  -4.05163 0.669916 -0.63573
C  -3.150172 2.587088 1.152338
C  -4.074369 2.013285 -0.987024
C  -3.623742 2.976133 -0.093884
H  1.946014 0.460053 1.14676
H  3.106249 0.251451 -1.699894
H  5.333192 2.119608 0.445544
H  4.596501 1.950474 -1.147046
H  5.851298 0.828727 -0.634783
H  3.736676 -0.910366 1.990303
H  4.975777 0.315742 2.183814
H  5.260314 -1.05112 1.112999
H  2.711254 3.074296 -0.026172
H  1.052855 4.533716 -0.860482
H  -0.047306 3.759346 -2.007315
H  -0.57152 4.047672 -0.363767
H  -0.346214 0.767214 0.250422
H  -1.126994 1.583911 -1.097537
H  0.223645 0.49499 -1.385702
H  1.325837 -3.526128 1.516586
H  1.535399 -3.873909 -0.198126
H  -0.942761 -2.052617 2.302613
H  -0.563502 -2.894134 -1.920369
H  -3.60227 -1.300626 2.067931
H  -4.353407 -1.730621 0.542462
H  -2.757341 0.947368 2.474392
H  -4.410376 -0.073818 -1.337808
H  -2.798199 3.331053 1.855919
H  -4.446992 2.308213 -1.959929
H  -3.643793 4.023713 -0.36624
elementType: O C H
totalener: -1079.74882695 hartree
nucrepener: 2233.89674267 hartree
electener: -3313.64556963 hartree
oneelecener: -5906.99840004 hartree
twoeener: 2593.35283041 hartree
cpcmener: -0.02414057 hartree
kineticenergy: 1074.86375669 hartree
xcener: -106.463622450302 hartree
chargesum: 0.0000000
charge: -0.281185 -0.474417 -0.274890 0.158171 0.015408 -0.096204 -0.291279 -0.274210 -0.349234 0.364298 0.072661 -0.235816 -0.323520 0.073536 -0.055050 -0.343749 -0.020601 0.204446 -0.054146 0.068633 -0.223644 -0.197611 -0.124750 -0.129440 -0.207505 0.100969 0.091581 0.098586 0.091709 0.098365 0.091516 0.092274 0.099394 0.121576 0.091381 0.101284 0.092230 0.095890 0.099723 0.113660 0.111153 0.119916 0.155710 0.166766 0.109169 0.114951 0.136643 0.137269 0.156140 0.154293 0.157951
qa: -0.2812 -0.4744 -0.2749 0.1582 0.0154 -0.0962 -0.2913 -0.2742 -0.3492 0.3643 0.0727 -0.2358 -0.3235 0.0735 -0.0551 -0.3437 -0.0206 0.2044 -0.0541 0.0686 -0.2236 -0.1976 -0.1247 -0.1294 -0.2075 0.1010 0.0916 0.0986 0.0917 0.0984 0.0915 0.0923 0.0994 0.1216 0.0914 0.1013 0.0922 0.0959 0.0997 0.1137 0.1112 0.1199 0.1557 0.1668 0.1092 0.1150 0.1366 0.1373 0.1561 0.1543 0.1580
va: 2.0984 2.0236 2.2708 3.7358 3.7586 3.8086 3.9134 3.8832 3.8832 4.1850 3.6107 3.9163 3.9831 3.8322 3.6118 3.9776 3.9307 3.5999 3.8062 3.5461 3.9027 3.9497 3.8140 3.8572 3.8701 1.0246 1.0298 0.9996 1.0021 1.0026 1.0153 1.0009 1.0000 1.0054 1.0096 0.9940 0.9951 0.9922 1.0112 1.0045 0.9975 1.0127 1.0092 1.0073 1.0108 1.0081 1.0060 1.0100 0.9901 0.9914 0.9911
dispcorr: -0.029439913 hartree
energy: -1079.778266867282
dipole: 11.28140 -11.62886 -0.34745 16.31678 -15.74983 0.56695 2.80709 -1.42736 1.37973
magnitude: 1.53161 au
magnitude: 3.89303 debye
