program: Orca
programVersion: 5.0.2
elementType: O O O C C C C C C C C C C C C C C C C C C C C C C H H H H H H H H H H H H H H H H H H H H H H H H H H
charge: 0
multiplicity: 1
keywords: wb97x-d3
keywords: def2-TZVPP
keywords: def2/J RIJCOSX
keywords: DEFGRID2
keywords: scfconv7
keywords: smallprint printgap noloewdin
keywords: NOSOSCF
formula: C22H26O3
InChI: InChI=1/C22H26O3/c1-15(2)10-19-20(22(19,3)4)21(23)25-14-17-12-18(24-13-17)11-16-8-6-5-7-9-16/h5-10,12-13,19-20H,11,14H2,1-4H3
51 atoms
O  2.074143 -2.001514 0.389547
O  2.210823 -2.103195 -1.835936
O  -2.091664 -2.024967 -0.766378
C  3.922558 0.452738 0.254411
C  2.496637 0.877065 0.257166
C  2.974257 -0.148089 -0.769262
C  4.959007 1.383805 -0.3312
C  4.453986 -0.36346 1.407517
C  2.009793 2.200741 -0.198965
C  2.404258 -1.505513 -0.800501
C  0.768198 2.385127 -0.657772
C  0.270962 3.731407 -1.079401
C  -0.196712 1.237997 -0.785329
C  1.191428 -3.137196 0.415489
C  -0.211289 -2.685501 0.207302
C  -1.111286 -2.192802 1.207498
C  -0.868233 -2.553379 -0.970266
C  -2.237692 -1.809509 0.562181
C  -3.507123 -1.186926 1.020856
C  -3.54497 0.294946 0.730314
C  -4.064522 0.777023 -0.467189
C  -3.018527 1.201514 1.64666
C  -4.059889 2.138483 -0.742506
C  -3.011709 2.561953 1.374634
C  -3.53362 3.035151 0.17755
H  1.900961 0.433471 1.051781
H  3.111707 0.235493 -1.774137
H  4.588134 1.935328 -1.195401
H  5.838782 0.823247 -0.653401
H  5.288054 2.112215 0.412925
H  4.921099 0.300646 2.137924
H  5.217988 -1.068264 1.073074
H  3.683319 -0.924532 1.93047
H  2.685482 3.048265 -0.129408
H  1.031354 4.505394 -0.972459
H  -0.056521 3.719448 -2.122694
H  -0.600432 4.02902 -0.489555
H  -1.17249 1.567901 -1.141107
H  0.169025 0.485514 -1.489246
H  -0.3506 0.728588 0.168211
H  1.318517 -3.56747 1.40723
H  1.495259 -3.884448 -0.317084
H  -0.934708 -2.137868 2.270713
H  -0.607294 -2.791861 -1.989391
H  -3.596572 -1.358087 2.094485
H  -4.358312 -1.684372 0.548688
H  -4.481275 0.08518 -1.189985
H  -2.607921 0.838737 2.582082
H  -4.469856 2.499264 -1.677389
H  -2.600715 3.25359 2.099286
H  -3.533374 4.096702 -0.034654
elementType: O C H
totalener: -1079.74882226 hartree
nucrepener: 2236.73181916 hartree
electener: -3316.48064142 hartree
oneelecener: -5912.65491286 hartree
twoeener: 2596.17427144 hartree
cpcmener: -0.02415206 hartree
kineticenergy: 1074.86300491 hartree
xcener: -106.463514112882 hartree
chargesum: 0.0000000
charge: -0.281352 -0.474706 -0.273789 0.161797 0.010094 -0.093593 -0.292053 -0.274187 -0.347220 0.363213 0.069626 -0.233042 -0.324944 0.072726 -0.056239 -0.334570 -0.023959 0.199642 -0.055166 0.067905 -0.195760 -0.221812 -0.131127 -0.123260 -0.210217 0.101794 0.090693 0.091689 0.098364 0.098887 0.092094 0.099504 0.091355 0.121962 0.090792 0.101933 0.091993 0.102760 0.114811 0.092182 0.110665 0.120422 0.156284 0.166479 0.111135 0.113445 0.137104 0.136708 0.154125 0.155930 0.158882
qa: -0.2814 -0.4747 -0.2738 0.1618 0.0101 -0.0936 -0.2921 -0.2742 -0.3472 0.3632 0.0696 -0.2330 -0.3249 0.0727 -0.0562 -0.3346 -0.0240 0.1996 -0.0552 0.0679 -0.1958 -0.2218 -0.1311 -0.1233 -0.2102 0.1018 0.0907 0.0917 0.0984 0.0989 0.0921 0.0995 0.0914 0.1220 0.0908 0.1019 0.0920 0.1028 0.1148 0.0922 0.1107 0.1204 0.1563 0.1665 0.1111 0.1134 0.1371 0.1367 0.1541 0.1559 0.1589
va: 2.0987 2.0231 2.2704 3.7345 3.7629 3.8070 3.9141 3.8821 3.8825 4.1866 3.6142 3.9158 3.9812 3.8310 3.6140 3.9808 3.9258 3.6072 3.8058 3.5430 3.9463 3.9030 3.8534 3.8174 3.8700 1.0238 1.0302 1.0019 1.0025 0.9994 1.0009 1.0000 1.0154 1.0052 1.0092 0.9940 0.9954 1.0107 1.0048 0.9921 0.9978 1.0128 1.0087 1.0079 1.0100 1.0093 1.0091 1.0059 0.9917 0.9901 0.9906
dispcorr: -0.029549812 hartree
energy: -1079.778372073161
dipole: 11.17412 -11.51856 -0.34444 16.13859 -15.58444 0.55415 2.64158 -1.25816 1.38342
magnitude: 1.52957 au
magnitude: 3.88785 debye
