program: Orca
programVersion: 5.0.2
elementType: O O O C C C C C C C C C C C C C C C C C C C C C C H H H H H H H H H H H H H H H H H H H H H H H H H H
charge: 0
multiplicity: 1
keywords: wb97x-d3
keywords: def2-TZVPP
keywords: def2/J RIJCOSX
keywords: DEFGRID2
keywords: scfconv7
keywords: smallprint printgap noloewdin
keywords: NOSOSCF
formula: C22H26O3
InChI: InChI=1/C22H26O3/c1-15(2)10-19-20(22(19,3)4)21(23)25-14-17-12-18(24-13-17)11-16-8-6-5-7-9-16/h5-10,12-13,19-20H,11,14H2,1-4H3
51 atoms
O  1.830578 -2.193304 0.262208
O  1.356605 -1.462635 -1.797993
O  -2.484344 -2.598054 -0.308239
C  1.305316 1.211115 -0.06835
C  2.408918 1.229503 -1.090242
C  2.269234 0.039247 -0.172927
C  1.416024 2.057873 1.175946
C  -0.119055 1.069248 -0.55106
C  3.596514 2.097932 -0.958413
C  1.781039 -1.255841 -0.68622
C  4.139058 2.864218 -1.910708
C  5.368774 3.676117 -1.62998
C  3.616699 2.995811 -3.308466
C  1.069227 -3.393736 0.046266
C  -0.378199 -3.084547 0.183252
C  -1.042704 -2.629967 1.368808
C  -1.307347 -3.035949 -0.798791
C  -2.315995 -2.343731 1.011269
C  -3.455081 -1.727121 1.741795
C  -3.479269 -0.230937 1.528513
C  -2.883544 0.621126 2.454162
C  -4.040447 0.316968 0.378048
C  -2.848885 1.992034 2.237615
C  -4.006003 1.687319 0.158253
C  -3.409737 2.52972 1.087427
H  2.068363 1.050498 -2.104638
H  2.977275 -0.036949 0.646066
H  0.768312 1.663585 1.961972
H  1.097156 3.082225 0.971225
H  2.427816 2.100219 1.577336
H  -0.733038 0.548727 0.188091
H  -0.203615 0.533296 -1.494162
H  -0.556171 2.058183 -0.700926
H  4.07935 2.095797 0.014878
H  5.184521 4.741035 -1.795855
H  5.721393 3.552106 -0.605956
H  6.185427 3.397355 -2.301567
H  3.425817 4.044809 -3.545712
H  4.359411 2.64871 -4.030423
H  2.696312 2.445643 -3.488902
H  1.409003 -4.077312 0.823069
H  1.299386 -3.841919 -0.921275
H  -0.616519 -2.51753 2.353869
H  -1.275482 -3.277443 -1.849933
H  -3.34501 -1.950251 2.803693
H  -4.398071 -2.17439 1.418094
H  -2.441426 0.208739 3.353863
H  -4.511682 -0.330118 -0.352728
H  -2.384886 2.640586 2.970094
H  -4.448256 2.098257 -0.740539
H  -3.384251 3.598401 0.916801
elementType: O C H
totalener: -1079.75319354 hartree
nucrepener: 2185.37678192 hartree
electener: -3265.12997547 hartree
oneelecener: -5810.30096488 hartree
twoeener: 2545.17098942 hartree
cpcmener: -0.02566681 hartree
kineticenergy: 1074.85986450 hartree
xcener: -106.462008210575 hartree
chargesum: -0.0000000
charge: -0.283452 -0.457219 -0.273747 0.157135 0.026209 -0.081929 -0.283483 -0.271856 -0.276721 0.358156 -0.050833 -0.218994 -0.251484 0.091706 -0.057366 -0.346017 -0.028262 0.209906 -0.060544 0.046560 -0.180306 -0.188451 -0.161709 -0.151933 -0.176026 0.089266 0.090343 0.092803 0.098368 0.091272 0.050661 0.100067 0.104910 0.114381 0.092562 0.087600 0.092462 0.094046 0.096099 0.089652 0.120280 0.115479 0.156783 0.170981 0.106215 0.114496 0.136320 0.137657 0.156525 0.155144 0.156288
qa: -0.2835 -0.4572 -0.2737 0.1571 0.0262 -0.0819 -0.2835 -0.2719 -0.2767 0.3582 -0.0508 -0.2190 -0.2515 0.0917 -0.0574 -0.3460 -0.0283 0.2099 -0.0605 0.0466 -0.1803 -0.1885 -0.1617 -0.1519 -0.1760 0.0893 0.0903 0.0928 0.0984 0.0913 0.0507 0.1001 0.1049 0.1144 0.0926 0.0876 0.0925 0.0940 0.0961 0.0897 0.1203 0.1155 0.1568 0.1710 0.1062 0.1145 0.1363 0.1377 0.1565 0.1551 0.1563
va: 2.1055 2.0479 2.2709 3.6340 3.8032 3.8062 3.9082 3.9056 3.8759 4.2559 3.7648 3.9213 3.9416 3.8420 3.6319 3.9752 3.9514 3.6054 3.8181 3.5940 3.8907 3.9367 3.8597 3.8890 3.8678 1.0341 1.0353 1.0032 1.0013 1.0082 1.0091 1.0241 1.0002 1.0122 0.9964 1.0092 0.9959 0.9975 0.9966 1.0107 0.9919 1.0093 1.0108 1.0002 1.0121 1.0111 1.0049 1.0112 0.9912 0.9914 0.9915
dispcorr: -0.026727399 hartree
energy: -1079.779920941038
dipole: 14.53461 -14.50946 0.02514 22.36439 -22.02944 0.33495 -3.20580 4.31282 1.10702
magnitude: 1.15686 au
magnitude: 2.94050 debye
