program: Orca
programVersion: 5.0.2
elementType: O O O C C C C C C C C C C C C C C C C C C C C C C H H H H H H H H H H H H H H H H H H H H H H H H H H
charge: 0
multiplicity: 1
keywords: wb97x-d3
keywords: def2-TZVPP
keywords: def2/J RIJCOSX
keywords: DEFGRID2
keywords: scfconv7
keywords: smallprint printgap noloewdin
keywords: NOSOSCF
formula: C22H26O3
InChI: InChI=1/C22H26O3/c1-15(2)10-19-20(22(19,3)4)21(23)25-14-17-12-18(24-13-17)11-16-8-6-5-7-9-16/h5-10,12-13,19-20H,11,14H2,1-4H3
51 atoms
O  1.917478 -2.245382 -0.801023
O  1.92797 -1.695232 1.365875
O  -2.299655 -2.01427 -1.028371
C  3.588276 0.805951 0.495292
C  2.14154 1.140992 0.367375
C  2.681695 -0.128025 -0.28152
C  4.582188 1.562344 -0.35444
C  4.142289 0.419674 1.844782
C  1.643341 2.256568 -0.477772
C  2.164789 -1.414801 0.213667
C  0.601015 2.186075 -1.310527
C  0.17329 3.368628 -2.124413
C  -0.211196 0.942799 -1.515904
C  1.0554 -3.372728 -0.555835
C  -0.35068 -2.897891 -0.440182
C  -1.054019 -2.487043 0.738512
C  -1.165421 -2.586557 -1.476659
C  -2.225656 -1.951981 0.32296
C  -3.310524 -1.230295 1.036642
C  -3.12915 0.2657 0.908326
C  -3.930678 1.018785 0.058429
C  -2.109486 0.905388 1.610849
C  -3.722601 2.386105 -0.084058
C  -1.897987 2.268021 1.470329
C  -2.705833 3.014522 0.620056
H  1.559599 0.949416 1.267312
H  2.793848 -0.082222 -1.358677
H  4.869408 2.498993 0.128138
H  4.190011 1.805105 -1.342445
H  5.490931 0.97404 -0.496882
H  4.968036 -0.287706 1.744199
H  3.399453 -0.023049 2.503511
H  4.533588 1.308323 2.344693
H  2.168992 3.203717 -0.384888
H  0.186234 3.133402 -3.192287
H  -0.854399 3.656171 -1.885941
H  0.81295 4.236527 -1.963714
H  -0.072207 0.205645 -0.728412
H  -1.275599 1.183286 -1.563214
H  0.039354 0.46727 -2.468883
H  1.376716 -3.930613 0.324065
H  1.186726 -4.012708 -1.426751
H  -0.721544 -2.570379 1.76079
H  -1.067973 -2.707929 -2.544866
H  -3.278821 -1.522811 2.087638
H  -4.289196 -1.526818 0.652285
H  -4.725976 0.536023 -0.497516
H  -1.470378 0.330014 2.271516
H  -4.356752 2.95948 -0.748534
H  -1.100765 2.74876 2.023271
H  -2.543417 4.079223 0.510261
elementType: O C H
totalener: -1079.75000306 hartree
nucrepener: 2277.12779128 hartree
electener: -3356.87779434 hartree
oneelecener: -5993.84303249 hartree
twoeener: 2636.96523815 hartree
cpcmener: -0.02313308 hartree
kineticenergy: 1074.86529180 hartree
xcener: -106.464301040226 hartree
chargesum: 0.0000000
charge: -0.287181 -0.471637 -0.270170 0.159722 -0.001967 -0.091694 -0.286525 -0.287955 -0.302219 0.364654 -0.011595 -0.223585 -0.212656 0.075493 -0.070474 -0.287878 -0.052945 0.186167 -0.054519 0.059568 -0.193398 -0.206844 -0.127256 -0.141453 -0.204372 0.099150 0.091700 0.098204 0.092345 0.097727 0.098252 0.092795 0.092431 0.119067 0.099552 0.090441 0.089567 0.024096 0.100510 0.122394 0.116063 0.121091 0.156815 0.172551 0.115650 0.106614 0.137228 0.137959 0.154754 0.154904 0.158860
qa: -0.2872 -0.4716 -0.2702 0.1597 -0.0020 -0.0917 -0.2865 -0.2880 -0.3022 0.3647 -0.0116 -0.2236 -0.2127 0.0755 -0.0705 -0.2879 -0.0529 0.1862 -0.0545 0.0596 -0.1934 -0.2068 -0.1273 -0.1415 -0.2044 0.0992 0.0917 0.0982 0.0923 0.0977 0.0983 0.0928 0.0924 0.1191 0.0996 0.0904 0.0896 0.0241 0.1005 0.1224 0.1161 0.1211 0.1568 0.1726 0.1157 0.1066 0.1372 0.1380 0.1548 0.1549 0.1589
va: 2.1068 2.0270 2.2630 3.7172 3.7866 3.8100 3.9052 3.8829 3.8593 4.1873 3.7209 3.9265 3.9171 3.8548 3.6393 3.9674 3.9246 3.6411 3.8205 3.5607 3.9479 3.8744 3.8540 3.8243 3.8613 1.0241 1.0319 1.0005 1.0025 1.0030 0.9992 1.0216 1.0008 1.0056 0.9962 0.9974 1.0069 1.0136 1.0008 1.0037 1.0083 0.9958 1.0167 0.9948 1.0080 1.0133 1.0054 1.0071 0.9909 0.9928 0.9905
dispcorr: -0.031029579 hartree
energy: -1079.781032642558
dipole: 11.10102 -11.27805 -0.17703 16.41858 -16.11603 0.30255 -2.97929 2.15651 -0.82278
magnitude: 0.89434 au
magnitude: 2.27322 debye
