program: Orca
programVersion: 5.0.2
elementType: O O O C C C C C C C C C C C C C C C C C C C C C C H H H H H H H H H H H H H H H H H H H H H H H H H H
charge: 0
multiplicity: 1
keywords: wb97x-d3
keywords: def2-TZVPP
keywords: def2/J RIJCOSX
keywords: DEFGRID2
keywords: scfconv7
keywords: smallprint printgap noloewdin
keywords: NOSOSCF
formula: C22H26O3
InChI: InChI=1/C22H26O3/c1-15(2)10-19-20(22(19,3)4)21(23)25-14-17-12-18(24-13-17)11-16-8-6-5-7-9-16/h5-10,12-13,19-20H,11,14H2,1-4H3
51 atoms
O  1.858519 -2.231794 0.348771
O  1.433762 -1.565519 -1.743091
O  -2.440523 -2.684378 -0.33819
C  1.317205 1.156965 -0.094192
C  2.447435 1.15295 -1.086255
C  2.294006 -0.009509 -0.141222
C  1.400749 2.047683 1.120451
C  -0.092777 0.997165 -0.609338
C  3.6184 2.047357 -0.946995
C  1.828434 -1.323106 -0.627596
C  3.99705 2.99066 -1.814999
C  5.216989 3.824295 -1.562442
C  3.271374 3.312989 -3.085402
C  1.106149 -3.440848 0.150878
C  -0.345375 -3.131255 0.232424
C  -1.042015 -2.617343 1.374149
C  -1.249304 -3.142502 -0.773849
C  -2.307484 -2.35945 0.96969
C  -3.468527 -1.715211 1.640444
C  -3.444723 -0.218346 1.432668
C  -2.851339 0.612804 2.378722
C  -3.95654 0.34932 0.268997
C  -2.771147 1.982844 2.169283
C  -3.877421 1.719161 0.056789
C  -3.283708 2.540569 1.006067
H  2.135449 0.944291 -2.104655
H  2.979882 -0.055228 0.698893
H  0.743607 1.678744 1.910896
H  1.079497 3.061995 0.873052
H  2.407518 2.111502 1.532196
H  -0.518599 1.979923 -0.821732
H  -0.731852 0.517676 0.136129
H  -0.153148 0.414907 -1.526842
H  4.218385 1.914844 -0.050829
H  4.961021 4.885533 -1.498046
H  5.724731 3.545431 -0.638944
H  5.934805 3.730845 -2.382068
H  2.998015 4.371233 -3.109724
H  3.912198 3.142775 -3.954832
H  2.359022 2.736822 -3.226559
H  1.424013 -4.096131 0.960732
H  1.366856 -3.921258 -0.793247
H  -0.641952 -2.448823 2.362251
H  -1.189812 -3.440552 -1.809116
H  -3.424256 -1.94294 2.706316
H  -4.40225 -2.138594 1.263001
H  -2.446291 0.184837 3.28861
H  -4.423603 -0.282177 -0.477978
H  -2.30907 2.614939 2.917233
H  -4.282353 2.146091 -0.852093
H  -3.222686 3.608723 0.841114
elementType: O C H
totalener: -1079.75265367 hartree
nucrepener: 2191.89434272 hartree
electener: -3271.64699639 hartree
oneelecener: -5823.33287225 hartree
twoeener: 2551.68587586 hartree
cpcmener: -0.02558065 hartree
kineticenergy: 1074.85985900 hartree
xcener: -106.461679156687 hartree
chargesum: 0.0000000
charge: -0.283774 -0.456480 -0.273021 0.188128 0.014424 -0.112233 -0.278414 -0.280133 -0.283574 0.362858 -0.034186 -0.225071 -0.253355 0.092374 -0.058335 -0.348697 -0.029163 0.212188 -0.061869 0.042293 -0.170421 -0.187457 -0.170422 -0.154573 -0.170552 0.091644 0.091606 0.093407 0.097493 0.091807 0.104951 0.047281 0.100415 0.117415 0.093031 0.088518 0.093126 0.093917 0.096831 0.090031 0.120375 0.115569 0.157312 0.171678 0.108699 0.112310 0.136500 0.137806 0.156322 0.155269 0.156153
qa: -0.2838 -0.4565 -0.2730 0.1881 0.0144 -0.1122 -0.2784 -0.2801 -0.2836 0.3629 -0.0342 -0.2251 -0.2534 0.0924 -0.0583 -0.3487 -0.0292 0.2122 -0.0619 0.0423 -0.1704 -0.1875 -0.1704 -0.1546 -0.1706 0.0916 0.0916 0.0934 0.0975 0.0918 0.1050 0.0473 0.1004 0.1174 0.0930 0.0885 0.0931 0.0939 0.0968 0.0900 0.1204 0.1156 0.1573 0.1717 0.1087 0.1123 0.1365 0.1378 0.1563 0.1553 0.1562
va: 2.1058 2.0493 2.2715 3.6173 3.7969 3.8544 3.9039 3.9064 3.8746 4.2493 3.7332 3.9248 3.9439 3.8421 3.6355 3.9715 3.9524 3.6054 3.8159 3.6001 3.8805 3.9300 3.8659 3.8881 3.8610 1.0313 1.0368 1.0041 1.0024 1.0064 1.0002 1.0102 1.0243 1.0091 0.9965 1.0086 0.9956 0.9977 0.9969 1.0091 0.9917 1.0089 1.0110 0.9996 1.0107 1.0131 1.0044 1.0101 0.9915 0.9915 0.9916
dispcorr: -0.027147695 hartree
energy: -1079.779801364662
dipole: 13.47761 -13.52992 -0.05230 23.37882 -22.94531 0.43352 -3.05990 4.16740 1.10751
magnitude: 1.19048 au
magnitude: 3.02596 debye
