program: Orca
programVersion: 5.0.2
elementType: O O O C C C C C C C C C C C C C C C C C C C C C C H H H H H H H H H H H H H H H H H H H H H H H H H H
charge: 0
multiplicity: 1
keywords: wb97x-d3
keywords: def2-TZVPP
keywords: def2/J RIJCOSX
keywords: DEFGRID2
keywords: scfconv7
keywords: smallprint printgap noloewdin
keywords: NOSOSCF
formula: C22H26O3
InChI: InChI=1/C22H26O3/c1-15(2)10-19-20(22(19,3)4)21(23)25-14-17-12-18(24-13-17)11-16-8-6-5-7-9-16/h5-10,12-13,19-20H,11,14H2,1-4H3
51 atoms
O  1.216035 -1.637636 -1.219716
O  0.777513 0.492469 -1.740149
O  -2.363774 -2.445041 1.36362
C  3.34192 0.889757 0.064424
C  3.647771 1.154348 -1.379433
C  2.963189 -0.133473 -0.997815
C  4.470239 0.491042 0.983082
C  2.283504 1.720577 0.746295
C  5.0326 1.118357 -1.910673
C  1.550896 -0.357017 -1.363189
C  5.779038 2.194668 -2.173031
C  7.168899 2.064453 -2.717755
C  5.318521 3.601673 -1.944937
C  -0.136973 -2.026643 -1.503666
C  -1.010777 -1.891558 -0.307461
C  -1.395382 -0.703638 0.399489
C  -1.628196 -2.910935 0.33385
C  -2.211209 -1.100752 1.403515
C  -2.970512 -0.352548 2.439829
C  -4.4263 -0.198855 2.066385
C  -4.855938 0.923654 1.363696
C  -5.352823 -1.188535 2.381846
C  -6.184387 1.056822 0.984787
C  -6.681901 -1.059498 2.001229
C  -7.10152 0.063522 1.300743
H  2.990995 1.885884 -1.841527
H  3.575799 -1.029129 -0.998659
H  5.196052 -0.162115 0.499228
H  4.086771 -0.03314 1.860732
H  5.006473 1.375425 1.334905
H  1.763863 1.146495 1.516953
H  1.537168 2.114598 0.059511
H  2.751499 2.576297 1.237729
H  5.462737 0.137563 -2.0936
H  7.898949 2.518422 -2.042028
H  7.456053 1.024259 -2.872182
H  7.268294 2.586552 -3.673219
H  5.984471 4.111853 -1.243623
H  5.351529 4.178646 -2.87288
H  4.30829 3.668759 -1.544405
H  -0.076297 -3.071434 -1.806643
H  -0.523601 -1.457694 -2.350305
H  -1.111741 0.313894 0.185916
H  -1.636846 -3.977734 0.170501
H  -2.509792 0.629836 2.551408
H  -2.880532 -0.857002 3.40538
H  -4.144825 1.702347 1.11266
H  -5.035971 -2.066319 2.933004
H  -6.503339 1.938686 0.443447
H  -7.391267 -1.837706 2.252985
H  -8.138219 0.16599 1.006334
elementType: O C H
totalener: -1079.75397153 hartree
nucrepener: 2046.83011903 hartree
electener: -3126.58409056 hartree
oneelecener: -5532.87617279 hartree
twoeener: 2406.29208223 hartree
cpcmener: -0.02480033 hartree
kineticenergy: 1074.85718425 hartree
xcener: -106.459294995452 hartree
chargesum: -0.0000000
charge: -0.281706 -0.474697 -0.279985 0.159408 -0.012987 -0.130459 -0.268203 -0.305343 -0.262510 0.415706 -0.033135 -0.229708 -0.249828 0.076278 -0.082988 -0.310155 -0.040703 0.210527 -0.064375 0.059013 -0.200505 -0.202858 -0.149401 -0.152840 -0.175957 0.097732 0.091303 0.090782 0.099049 0.095584 0.100226 0.094361 0.097087 0.119998 0.093517 0.088704 0.094521 0.095420 0.098219 0.087147 0.114792 0.118939 0.162837 0.173932 0.108529 0.114923 0.140159 0.139416 0.157003 0.155965 0.157265
qa: -0.2817 -0.4747 -0.2800 0.1594 -0.0130 -0.1305 -0.2682 -0.3053 -0.2625 0.4157 -0.0331 -0.2297 -0.2498 0.0763 -0.0830 -0.3102 -0.0407 0.2105 -0.0644 0.0590 -0.2005 -0.2029 -0.1494 -0.1528 -0.1760 0.0977 0.0913 0.0908 0.0990 0.0956 0.1002 0.0944 0.0971 0.1200 0.0935 0.0887 0.0945 0.0954 0.0982 0.0871 0.1148 0.1189 0.1628 0.1739 0.1085 0.1149 0.1402 0.1394 0.1570 0.1560 0.1573
va: 2.1248 2.0284 2.2794 3.6564 3.7826 3.9016 3.9000 3.9009 3.8633 4.1730 3.7069 3.9281 3.9421 3.8496 3.6973 4.0095 3.9705 3.6559 3.8197 3.5814 3.9464 3.9631 3.8928 3.8987 3.9037 1.0256 1.0368 1.0029 1.0026 1.0026 0.9999 1.0162 1.0027 1.0079 0.9961 1.0080 0.9955 0.9975 0.9984 1.0086 0.9984 1.0081 1.0167 0.9944 1.0107 1.0090 1.0044 1.0095 0.9907 0.9911 0.9906
dispcorr: -0.022715504 hartree
energy: -1079.776687037144
dipole: 29.05896 -28.30923 0.74974 16.40076 -16.58509 -0.18434 -2.45835 2.92251 0.46416
magnitude: 0.90085 au
magnitude: 2.28978 debye
