program: Orca
programVersion: 5.0.2
elementType: O O O C C C C C C C C C C C C C C C C C C C C C C H H H H H H H H H H H H H H H H H H H H H H H H H H
charge: 0
multiplicity: 1
keywords: wb97x-d3
keywords: def2-TZVPP
keywords: def2/J RIJCOSX
keywords: DEFGRID2
keywords: scfconv7
keywords: smallprint printgap noloewdin
keywords: NOSOSCF
formula: C22H26O3
InChI: InChI=1/C22H26O3/c1-15(2)10-19-20(22(19,3)4)21(23)25-14-17-12-18(24-13-17)11-16-8-6-5-7-9-16/h5-10,12-13,19-20H,11,14H2,1-4H3
51 atoms
O  1.4289 -1.073199 0.229349
O  1.370179 -0.53027 -1.939015
O  -2.279346 0.880835 0.428128
C  3.314102 1.750309 -0.915869
C  4.07108 0.703523 -1.658046
C  3.135665 0.284146 -0.541033
C  4.030057 2.590086 0.113944
C  2.212022 2.496394 -1.626923
C  5.537258 0.513524 -1.510823
C  1.90199 -0.455046 -0.856912
C  6.174669 -0.646256 -1.691301
C  7.663376 -0.749635 -1.563128
C  5.474424 -1.923518 -2.040081
C  0.206831 -1.795294 0.104881
C  -0.970837 -0.883227 0.119687
C  -2.305543 -1.214525 -0.275585
C  -1.018445 0.401704 0.540222
C  -3.056335 -0.10703 -0.063627
C  -4.511001 0.166719 -0.204114
C  -5.226946 0.041234 1.120512
C  -5.917781 -1.124122 1.438652
C  -5.172429 1.066605 2.061725
C  -6.542146 -1.26537 2.670693
C  -5.791396 0.926027 3.295884
C  -6.477054 -0.241573 3.605465
H  3.677593 0.48959 -2.649099
H  3.603257 -0.002174 0.394505
H  3.321019 2.986796 0.843368
H  4.525464 3.441644 -0.357632
H  4.786053 2.029808 0.664611
H  1.741589 1.91472 -2.416652
H  2.619375 3.398911 -2.087314
H  1.433052 2.809679 -0.928555
H  6.126383 1.39379 -1.268456
H  8.114265 -1.106845 -2.492989
H  8.123757 0.206245 -1.312835
H  7.941329 -1.47119 -0.790154
H  5.783964 -2.275372 -3.028275
H  5.740999 -2.71657 -1.336623
H  4.389211 -1.834185 -2.046964
H  0.185587 -2.464396 0.966494
H  0.206181 -2.421663 -0.789824
H  -2.655955 -2.158558 -0.663388
H  -0.275146 1.087433 0.91598
H  -4.925075 -0.545965 -0.918304
H  -4.664257 1.163908 -0.625034
H  -5.968759 -1.929838 0.71529
H  -4.644876 1.98452 1.830063
H  -7.077729 -2.177931 2.900459
H  -5.739349 1.731578 4.017556
H  -6.961072 -0.350449 4.567606
elementType: O C H
totalener: -1079.75237920 hartree
nucrepener: 2049.84834302 hartree
electener: -3129.60072222 hartree
oneelecener: -5538.91626943 hartree
twoeener: 2409.31554721 hartree
cpcmener: -0.02609299 hartree
kineticenergy: 1074.85884651 hartree
xcener: -106.461786352179 hartree
chargesum: 0.0000000
charge: -0.291758 -0.467059 -0.282714 0.154089 -0.034828 -0.087901 -0.288077 -0.275090 -0.282850 0.364206 -0.013838 -0.227085 -0.244434 0.110540 -0.028849 -0.348626 -0.061688 0.220943 -0.071200 0.056054 -0.197417 -0.202898 -0.147372 -0.154198 -0.175553 0.103311 0.092232 0.097021 0.098378 0.092095 0.094872 0.097371 0.093689 0.121850 0.094624 0.088967 0.094289 0.101236 0.094562 0.081245 0.119494 0.112790 0.159937 0.169733 0.104735 0.117174 0.138982 0.138755 0.156603 0.156328 0.157331
qa: -0.2918 -0.4671 -0.2827 0.1541 -0.0348 -0.0879 -0.2881 -0.2751 -0.2829 0.3642 -0.0138 -0.2271 -0.2444 0.1105 -0.0288 -0.3486 -0.0617 0.2209 -0.0712 0.0561 -0.1974 -0.2029 -0.1474 -0.1542 -0.1756 0.1033 0.0922 0.0970 0.0984 0.0921 0.0949 0.0974 0.0937 0.1218 0.0946 0.0890 0.0943 0.1012 0.0946 0.0812 0.1195 0.1128 0.1599 0.1697 0.1047 0.1172 0.1390 0.1388 0.1566 0.1563 0.1573
va: 2.1145 2.0280 2.2717 3.7074 3.8399 3.7947 3.9083 3.8831 3.8818 4.1747 3.7077 3.9296 3.9414 3.8214 3.6253 4.0118 3.9514 3.6122 3.8245 3.5944 3.9447 3.9596 3.8903 3.9011 3.9062 1.0266 1.0327 1.0034 0.9995 1.0018 1.0179 1.0023 1.0023 1.0032 0.9957 1.0068 0.9968 0.9986 0.9994 1.0144 0.9907 1.0128 1.0060 0.9982 1.0115 1.0083 1.0043 1.0128 0.9907 0.9912 0.9907
dispcorr: -0.022875248 hartree
energy: -1079.775254448574
dipole: 27.69037 -27.29410 0.39626 3.11537 -3.44143 -0.32606 -5.48326 6.14029 0.65703
magnitude: 0.83368 au
magnitude: 2.11905 debye
