program: Orca
programVersion: 5.0.2
elementType: O O O C C C C C C C C C C C C C C C C C C C C C C H H H H H H H H H H H H H H H H H H H H H H H H H H
charge: 0
multiplicity: 1
keywords: wb97x-d3
keywords: def2-TZVPP
keywords: def2/J RIJCOSX
keywords: DEFGRID2
keywords: scfconv7
keywords: smallprint printgap noloewdin
keywords: NOSOSCF
formula: C22H26O3
InChI: InChI=1/C22H26O3/c1-15(2)10-19-20(22(19,3)4)21(23)25-14-17-12-18(24-13-17)11-16-8-6-5-7-9-16/h5-10,12-13,19-20H,11,14H2,1-4H3
51 atoms
O  1.470071 -2.289247 -1.176528
O  1.927199 -1.815976 0.95816
O  -2.189473 -3.233115 1.28396
C  3.516268 0.605003 -0.260758
C  2.135873 1.063063 0.093949
C  2.314186 -0.180119 -0.752575
C  4.27396 1.358073 -1.326609
C  4.404803 0.066007 0.832546
C  1.495662 2.258705 -0.509531
C  1.906296 -1.486483 -0.203555
C  1.433408 3.462973 0.064929
C  0.716159 4.602285 -0.592371
C  2.046234 3.776591 1.394785
C  0.812942 -3.503748 -0.800196
C  -0.482644 -3.207234 -0.130444
C  -1.402871 -2.171739 -0.490073
C  -1.01307 -3.812542 0.955278
C  -2.412568 -2.225593 0.410623
C  -3.634764 -1.396318 0.602661
C  -3.394971 0.04672 0.235014
C  -2.395387 0.777923 0.876808
C  -4.158867 0.675636 -0.740665
C  -2.166816 2.104694 0.548858
C  -3.931749 2.006904 -1.073038
C  -2.933985 2.724296 -0.4314
H  1.855794 0.858193 1.123767
H  2.099353 -0.059061 -1.809037
H  3.632453 1.694766 -2.140949
H  5.056122 0.730877 -1.759097
H  4.756139 2.241215 -0.90129
H  3.84964 -0.357161 1.66641
H  5.023311 0.874114 1.229134
H  5.079518 -0.703678 0.451682
H  1.029213 2.126871 -1.481803
H  0.264283 4.313372 -1.5413
H  -0.075183 4.992777 0.053578
H  1.394848 5.438337 -0.782331
H  2.729612 4.625966 1.312509
H  1.280244 4.069484 2.118367
H  2.605701 2.944039 1.818869
H  1.453852 -4.126438 -0.172375
H  0.662193 -4.02851 -1.743784
H  -1.307212 -1.463855 -1.298722
H  -0.676707 -4.624393 1.581479
H  -3.949384 -1.465109 1.648018
H  -4.463492 -1.794907 0.010235
H  -1.786567 0.303432 1.638011
H  -4.939076 0.121456 -1.249422
H  -1.38907 2.657619 1.060089
H  -4.536588 2.479858 -1.836399
H  -2.755002 3.760461 -0.689274
elementType: O C H
totalener: -1079.75029085 hartree
nucrepener: 2195.24080934 hartree
electener: -3274.99110019 hartree
oneelecener: -5829.94199705 hartree
twoeener: 2554.95089686 hartree
cpcmener: -0.02554947 hartree
kineticenergy: 1074.86516521 hartree
xcener: -106.463561630725 hartree
chargesum: -0.0000000
charge: -0.289138 -0.465274 -0.277310 0.157964 -0.022541 -0.093829 -0.272175 -0.298285 -0.254475 0.385238 -0.056310 -0.246170 -0.247248 0.110584 -0.081263 -0.319462 -0.041290 0.199310 -0.033019 0.020788 -0.220724 -0.180510 -0.151149 -0.141821 -0.179845 0.102243 0.088326 0.091200 0.099182 0.095228 0.094252 0.093608 0.100445 0.121181 0.092394 0.092192 0.107213 0.099445 0.097101 0.087690 0.115048 0.114499 0.157662 0.173924 0.109417 0.098201 0.144622 0.138956 0.171912 0.156082 0.155932
qa: -0.2891 -0.4653 -0.2773 0.1580 -0.0225 -0.0938 -0.2722 -0.2983 -0.2545 0.3852 -0.0563 -0.2462 -0.2472 0.1106 -0.0813 -0.3195 -0.0413 0.1993 -0.0330 0.0208 -0.2207 -0.1805 -0.1511 -0.1418 -0.1798 0.1022 0.0883 0.0912 0.0992 0.0952 0.0943 0.0936 0.1004 0.1212 0.0924 0.0922 0.1072 0.0994 0.0971 0.0877 0.1150 0.1145 0.1577 0.1739 0.1094 0.0982 0.1446 0.1390 0.1719 0.1561 0.1559
va: 2.1130 2.0376 2.2783 3.6992 3.7774 3.8668 3.9074 3.8932 3.8175 4.1767 3.6807 3.9213 3.9386 3.8330 3.6761 3.9492 3.9510 3.6459 3.7938 3.6383 3.9479 3.9301 3.8387 3.9060 3.9025 1.0216 1.0385 1.0021 1.0030 1.0023 1.0203 1.0007 0.9998 1.0080 1.0068 0.9931 0.9993 0.9980 0.9990 1.0082 1.0060 0.9880 1.0097 0.9945 1.0090 1.0057 1.0029 1.0039 0.9733 0.9909 0.9921
dispcorr: -0.026502663 hartree
energy: -1079.776793517218
dipole: 15.73324 -15.77486 -0.04162 23.98776 -23.32308 0.66468 -1.55713 0.69338 -0.86375
magnitude: 1.09068 au
magnitude: 2.77229 debye
