program: Orca
programVersion: 5.0.2
elementType: O O O C C C C C C C C C C C C C C C C C C C C C C H H H H H H H H H H H H H H H H H H H H H H H H H H
charge: 0
multiplicity: 1
keywords: wb97x-d3
keywords: def2-TZVPP
keywords: def2/J RIJCOSX
keywords: DEFGRID2
keywords: scfconv7
keywords: smallprint printgap noloewdin
keywords: NOSOSCF
formula: C22H26O3
InChI: InChI=1/C22H26O3/c1-15(2)10-19-20(22(19,3)4)21(23)25-14-17-12-18(24-13-17)11-16-8-6-5-7-9-16/h5-10,12-13,19-20H,11,14H2,1-4H3
51 atoms
O  1.263714 -0.341779 0.945766
O  2.126652 -1.674684 -0.628943
O  -2.175582 -2.759366 -0.430467
C  2.558051 1.064489 -2.124696
C  3.837971 0.61618 -1.508798
C  2.586596 0.674947 -0.653264
C  2.345223 2.535797 -2.38799
C  1.885758 0.176373 -3.142617
C  4.966198 1.545328 -1.240164
C  1.987505 -0.572974 -0.149126
C  5.793997 1.461087 -0.19555
C  6.922203 2.429238 -0.011214
C  5.671839 0.41674 0.870316
C  0.601279 -1.455796 1.564921
C  -0.675819 -1.787918 0.880654
C  -1.934903 -1.119442 1.034352
C  -0.890055 -2.770149 -0.024682
C  -2.809925 -1.752036 0.217799
C  -4.259088 -1.574077 -0.073165
C  -4.827101 -0.377405 0.639429
C  -4.607618 0.906556 0.145334
C  -5.562028 -0.527452 1.810718
C  -5.115883 2.015484 0.805696
C  -6.075391 0.580618 2.473175
C  -5.853049 1.855321 1.972462
H  4.130521 -0.397096 -1.775676
H  2.523042 1.510011 0.035325
H  2.798154 3.169468 -1.625071
H  1.278903 2.768738 -2.416805
H  2.769912 2.821447 -3.352796
H  2.213243 0.458978 -4.145393
H  0.799971 0.287989 -3.109572
H  2.119254 -0.87797 -3.012179
H  5.134345 2.332426 -1.970524
H  6.960361 3.17391 -0.806393
H  6.8320 2.958083 0.94152
H  7.885119 1.91221 0.013843
H  5.491406 0.878528 1.845164
H  4.872979 -0.299427 0.686615
H  6.604926 -0.144822 0.96666
H  0.412557 -1.126831 2.585981
H  1.265301 -2.319765 1.610754
H  -2.147657 -0.283198 1.682018
H  -0.250299 -3.525039 -0.455015
H  -4.805515 -2.475481 0.221319
H  -4.403213 -1.469308 -1.153334
H  -4.035249 1.038774 -0.765767
H  -5.739679 -1.52024 2.20765
H  -4.939463 3.006585 0.40706
H  -6.65088 0.446241 3.380422
H  -6.25371 2.720122 2.485944
elementType: O C H
totalener: -1079.75345285 hartree
nucrepener: 2069.12587313 hartree
electener: -3148.87932597 hartree
oneelecener: -5577.45234578 hartree
twoeener: 2428.57301981 hartree
cpcmener: -0.02309225 hartree
kineticenergy: 1074.85704037 hartree
xcener: -106.460359108934 hartree
chargesum: 0.0000000
charge: -0.286947 -0.479940 -0.279826 0.151004 -0.022606 -0.108866 -0.287347 -0.281156 -0.289321 0.399574 -0.012981 -0.227146 -0.242699 0.089691 -0.108395 -0.291885 -0.014672 0.172892 -0.003158 0.002368 -0.200123 -0.183850 -0.152704 -0.155413 -0.165781 0.102002 0.092494 0.092833 0.097490 0.097940 0.094449 0.098833 0.092553 0.120902 0.089003 0.093411 0.095484 0.097850 0.081715 0.100467 0.119127 0.117697 0.160506 0.170306 0.101738 0.109009 0.142359 0.139689 0.157145 0.156568 0.157718
qa: -0.2869 -0.4799 -0.2798 0.1510 -0.0226 -0.1089 -0.2873 -0.2812 -0.2893 0.3996 -0.0130 -0.2271 -0.2427 0.0897 -0.1084 -0.2919 -0.0147 0.1729 -0.0032 0.0024 -0.2001 -0.1839 -0.1527 -0.1554 -0.1658 0.1020 0.0925 0.0928 0.0975 0.0979 0.0944 0.0988 0.0926 0.1209 0.0890 0.0934 0.0955 0.0979 0.0817 0.1005 0.1191 0.1177 0.1605 0.1703 0.1017 0.1090 0.1424 0.1397 0.1571 0.1566 0.1577
va: 2.1145 2.0235 2.2771 3.7023 3.8192 3.8141 3.9092 3.8918 3.8870 4.1469 3.7071 3.9305 3.9380 3.8182 3.6728 3.9863 3.9552 3.6807 3.8144 3.6274 3.9310 3.9322 3.8939 3.8999 3.8955 1.0260 1.0317 1.0019 1.0030 0.9999 1.0012 0.9990 1.0193 1.0037 1.0064 0.9968 0.9961 0.9988 1.0143 0.9993 0.9934 1.0109 1.0031 1.0049 1.0085 1.0049 1.0029 1.0043 0.9909 0.9910 0.9902
dispcorr: -0.022780831 hartree
energy: -1079.776233677335
dipole: 23.12951 -23.29278 -0.16327 14.70103 -13.74908 0.95194 -5.42949 6.03014 0.60065
magnitude: 1.13738 au
magnitude: 2.89099 debye
