program: Orca
programVersion: 5.0.2
elementType: O O O C C C C C C C C C C C C C C C C C C C C C C H H H H H H H H H H H H H H H H H H H H H H H H H H
charge: 0
multiplicity: 1
keywords: wb97x-d3
keywords: def2-TZVPP
keywords: def2/J RIJCOSX
keywords: DEFGRID2
keywords: scfconv7
keywords: smallprint printgap noloewdin
keywords: NOSOSCF
formula: C22H26O3
InChI: InChI=1/C22H26O3/c1-15(2)10-19-20(22(19,3)4)21(23)25-14-17-12-18(24-13-17)11-16-8-6-5-7-9-16/h5-10,12-13,19-20H,11,14H2,1-4H3
51 atoms
O  1.727685 -1.829438 0.161593
O  1.654647 0.186137 1.124664
O  -1.978536 -0.659905 -1.432272
C  4.626391 0.343972 0.089646
C  3.719926 1.118178 -0.801252
C  3.374095 -0.323629 -0.460347
C  5.926166 -0.188248 -0.464392
C  4.717499 0.721679 1.547644
C  4.072574 1.49524 -2.192646
C  2.183526 -0.58934 0.363825
C  3.183951 1.799752 -3.142505
C  3.618661 2.222397 -4.512006
C  1.701943 1.74769 -2.931857
C  0.500324 -2.188957 0.794897
C  -0.667712 -1.563889 0.111044
C  -1.940354 -1.264682 0.694371
C  -0.752861 -1.176409 -1.182373
C  -2.6953 -0.717388 -0.289275
C  -4.091281 -0.202995 -0.343047
C  -4.677757 -0.013244 1.029753
C  -5.62939 -0.895367 1.52938
C  -4.267075 1.052428 1.828739
C  -6.168316 -0.71484 2.797814
C  -4.801586 1.235091 3.0952
C  -5.756903 0.351463 3.583514
H  3.09103 1.835419 -0.279714
H  3.555506 -1.056428 -1.238433
H  5.838755 -0.527503 -1.496722
H  6.275523 -1.034935 0.129695
H  6.702683 0.579197 -0.43067
H  5.543405 1.42121 1.692469
H  4.917719 -0.153485 2.169284
H  3.81715 1.202739 1.923137
H  5.129372 1.555205 -2.437257
H  4.703705 2.22844 -4.616928
H  3.208913 1.558744 -5.278171
H  3.252733 3.225728 -4.746888
H  1.252529 2.731429 -3.093501
H  1.234882 1.076899 -3.658161
H  1.415858 1.411421 -1.936059
H  0.512657 -1.932141 1.85607
H  0.459018 -3.276851 0.726012
H  -2.23854 -1.430524 1.717872
H  -0.059274 -1.191085 -2.00884
H  -4.716765 -0.890846 -0.920844
H  -4.102363 0.746855 -0.886494
H  -5.958186 -1.729929 0.920903
H  -3.523063 1.746998 1.455062
H  -6.912941 -1.407719 3.169155
H  -4.474918 2.070819 3.701319
H  -6.178933 0.496586 4.569907
elementType: O C H
totalener: -1079.75220416 hartree
nucrepener: 2084.71484527 hartree
electener: -3164.46704943 hartree
oneelecener: -5608.68655110 hartree
twoeener: 2444.21950168 hartree
cpcmener: -0.02483410 hartree
kineticenergy: 1074.84853313 hartree
xcener: -106.460899387433 hartree
chargesum: -0.0000000
charge: -0.290399 -0.468032 -0.284160 0.154981 -0.032150 -0.067296 -0.294263 -0.274152 -0.288355 0.350536 -0.003941 -0.229999 -0.249655 0.117778 -0.055274 -0.313073 -0.067119 0.183704 -0.012849 -0.003684 -0.173035 -0.202148 -0.156474 -0.146979 -0.168263 0.101540 0.089729 0.091352 0.098286 0.100353 0.093641 0.098622 0.093115 0.122737 0.088803 0.093989 0.095270 0.102406 0.096638 0.075357 0.112996 0.116357 0.162605 0.177372 0.099928 0.110390 0.138722 0.143348 0.155907 0.157090 0.157752
qa: -0.2904 -0.4680 -0.2842 0.1550 -0.0322 -0.0673 -0.2943 -0.2742 -0.2884 0.3505 -0.0039 -0.2300 -0.2497 0.1178 -0.0553 -0.3131 -0.0671 0.1837 -0.0128 -0.0037 -0.1730 -0.2021 -0.1565 -0.1470 -0.1683 0.1015 0.0897 0.0914 0.0983 0.1004 0.0936 0.0986 0.0931 0.1227 0.0888 0.0940 0.0953 0.1024 0.0966 0.0754 0.1130 0.1164 0.1626 0.1774 0.0999 0.1104 0.1387 0.1433 0.1559 0.1571 0.1578
va: 2.1179 2.0271 2.2668 3.7167 3.8202 3.7818 3.9140 3.8840 3.8912 4.1875 3.6926 3.9298 3.9470 3.8116 3.6721 3.9881 3.9414 3.6736 3.8057 3.6335 3.9215 3.9352 3.8990 3.8882 3.8960 1.0265 1.0332 1.0011 1.0028 0.9987 1.0010 0.9993 1.0187 1.0033 1.0067 0.9968 0.9957 1.0003 0.9976 1.0130 1.0124 0.9914 1.0008 0.9931 1.0070 1.0065 1.0045 1.0018 0.9913 0.9907 0.9903
dispcorr: -0.023311099 hartree
energy: -1079.775515256653
dipole: 21.39965 -21.21495 0.18470 8.68654 -9.23012 -0.54357 -8.61410 8.07510 -0.53900
magnitude: 0.78747 au
magnitude: 2.00159 debye
