program: Orca
programVersion: 5.0.2
elementType: O O O C C C C C C C C C C C C C C C C C C C C C C H H H H H H H H H H H H H H H H H H H H H H H H H H
charge: 0
multiplicity: 1
keywords: wb97x-d3
keywords: def2-TZVPP
keywords: def2/J RIJCOSX
keywords: DEFGRID2
keywords: scfconv7
keywords: smallprint printgap noloewdin
keywords: NOSOSCF
formula: C22H26O3
InChI: InChI=1/C22H26O3/c1-15(2)10-19-20(22(19,3)4)21(23)25-14-17-12-18(24-13-17)11-16-8-6-5-7-9-16/h5-10,12-13,19-20H,11,14H2,1-4H3
51 atoms
O  1.764582 -1.965532 -0.050771
O  1.837801 -0.090175 1.166957
O  -2.275708 -0.917696 -0.634571
C  4.596798 0.269638 -0.312406
C  3.557299 1.108634 -0.989567
C  3.27941 -0.361935 -0.729245
C  5.812336 -0.186068 -1.084009
C  4.895488 0.540626 1.141871
C  3.685227 1.572526 -2.384128
C  2.238097 -0.750497 0.238484
C  3.402826 2.793934 -2.850323
C  3.579237 3.114699 -4.304535
C  2.906677 3.936952 -2.018122
C  0.726684 -2.508056 0.760074
C  -0.618358 -2.01254 0.354373
C  -1.868881 -2.503742 0.849472
C  -0.931099 -1.052582 -0.545658
C  -2.838443 -1.804192 0.213803
C  -4.322036 -1.818758 0.31317
C  -4.85181 -0.674481 1.145023
C  -5.001182 0.597749 0.597806
C  -5.173092 -0.869958 2.485051
C  -5.461466 1.65146 1.375641
C  -5.6371 0.181356 3.264466
C  -5.780992 1.446581 2.711736
H  3.03239 1.777043 -0.31588
H  3.348595 -1.014737 -1.592482
H  5.583786 -0.480382 -2.10751
H  6.272602 -1.046168 -0.593419
H  6.560434 0.608447 -1.125497
H  5.171192 -0.377176 1.666273
H  4.063616 0.996097 1.674839
H  5.743216 1.225509 1.215966
H  4.041109 0.834771 -3.097635
H  3.946131 2.260715 -4.874513
H  2.636212 3.437806 -4.753967
H  4.284277 3.939095 -4.443284
H  2.758862 3.69015 -0.9681
H  3.607861 4.775491 -2.062019
H  1.955452 4.313047 -2.406359
H  0.914445 -2.313771 1.818914
H  0.787672 -3.5876 0.616684
H  -2.019887 -3.279367 1.584379
H  -0.345333 -0.410626 -1.185124
H  -4.62031 -2.768398 0.759103
H  -4.759978 -1.788611 -0.688318
H  -4.761296 0.76728 -0.445547
H  -5.063362 -1.855538 2.922975
H  -5.574132 2.634771 0.936286
H  -5.888739 0.010038 4.303703
H  -6.14431 2.267194 3.317186
elementType: O C H
totalener: -1079.75398835 hartree
nucrepener: 2044.46527279 hartree
electener: -3124.21926114 hartree
oneelecener: -5528.27275649 hartree
twoeener: 2404.05349535 hartree
cpcmener: -0.02766985 hartree
kineticenergy: 1074.84063693 hartree
xcener: -106.459351046091 hartree
chargesum: -0.0000000
charge: -0.288866 -0.466057 -0.282945 0.099104 0.048168 -0.091047 -0.269654 -0.277468 -0.276664 0.374548 -0.051753 -0.216846 -0.251563 0.104133 -0.028026 -0.349942 -0.055469 0.222000 -0.070618 0.056857 -0.200481 -0.196637 -0.154062 -0.149250 -0.175618 0.094243 0.086489 0.087400 0.096657 0.097218 0.098540 0.092250 0.095125 0.115719 0.087846 0.093115 0.092329 0.090259 0.096052 0.094417 0.113870 0.123844 0.159420 0.163826 0.105783 0.116363 0.138480 0.138910 0.156133 0.156035 0.157833
qa: -0.2889 -0.4661 -0.2829 0.0991 0.0482 -0.0910 -0.2697 -0.2775 -0.2767 0.3745 -0.0518 -0.2168 -0.2516 0.1041 -0.0280 -0.3499 -0.0555 0.2220 -0.0706 0.0569 -0.2005 -0.1966 -0.1541 -0.1493 -0.1756 0.0942 0.0865 0.0874 0.0967 0.0972 0.0985 0.0922 0.0951 0.1157 0.0878 0.0931 0.0923 0.0903 0.0961 0.0944 0.1139 0.1238 0.1594 0.1638 0.1058 0.1164 0.1385 0.1389 0.1561 0.1560 0.1578
va: 2.1221 2.0335 2.2734 3.7023 3.7644 3.8242 3.9110 3.9034 3.8756 4.1899 3.7688 3.9202 3.9406 3.8307 3.6271 4.0129 3.9538 3.6108 3.8223 3.5893 3.9616 3.9449 3.9009 3.8922 3.9045 1.0309 1.0367 1.0065 1.0018 1.0017 0.9993 1.0198 0.9999 1.0122 1.0090 0.9963 0.9962 1.0108 0.9967 0.9969 1.0104 0.9920 1.0062 0.9986 1.0104 1.0072 1.0121 1.0043 0.9913 0.9910 0.9904
dispcorr: -0.021619299 hartree
energy: -1079.775607649985
dipole: 23.88034 -23.51956 0.36078 13.72199 -14.37852 -0.65653 -9.26966 8.73562 -0.53405
magnitude: 0.92000 au
magnitude: 2.33844 debye
