program: Orca
programVersion: 5.0.2
elementType: O O O C C C C C C C C C C C C C C C C C C C C C C H H H H H H H H H H H H H H H H H H H H H H H H H H
charge: 0
multiplicity: 1
keywords: wb97x-d3
keywords: def2-TZVPP
keywords: def2/J RIJCOSX
keywords: DEFGRID2
keywords: scfconv7
keywords: smallprint printgap noloewdin
keywords: NOSOSCF
formula: C22H26O3
InChI: InChI=1/C22H26O3/c1-15(2)10-19-20(22(19,3)4)21(23)25-14-17-12-18(24-13-17)11-16-8-6-5-7-9-16/h5-10,12-13,19-20H,11,14H2,1-4H3
51 atoms
O  1.470113 -1.952784 -0.887277
O  0.698357 0.020818 -1.600222
O  -1.763058 -1.619086 1.768616
C  3.093074 1.000616 0.236114
C  3.429047 1.182104 -1.214628
C  2.923951 -0.16087 -0.729812
C  4.202644 0.855079 1.248989
C  1.886312 1.72291 0.782547
C  4.817829 1.289008 -1.706557
C  1.588548 -0.643636 -1.127815
C  5.292989 2.204505 -2.557728
C  6.727279 2.174239 -2.994657
C  4.485528 3.314031 -3.159789
C  0.217844 -2.571839 -1.168739
C  -0.792916 -2.276112 -0.115398
C  -2.194503 -2.559444 -0.185074
C  -0.592111 -1.708812 1.095868
C  -2.731317 -2.139097 0.985269
C  -4.121786 -2.110677 1.505345
C  -4.652048 -0.702273 1.635206
C  -4.828643 -0.115813 2.883005
C  -4.956318 0.039162 0.495508
C  -5.309914 1.183435 2.993455
C  -5.437364 1.335251 0.602104
C  -5.616354 1.912284 1.853757
H  2.691633 1.75684 -1.764655
H  3.667614 -0.943647 -0.623732
H  4.583375 1.83545 1.543427
H  5.04424 0.27169 0.87748
H  3.834406 0.360087 2.149796
H  1.121399 1.911662 0.032197
H  2.191451 2.691073 1.185013
H  1.425809 1.161767 1.598864
H  5.51077 0.535402 -1.342858
H  6.804756 2.10359 -4.083202
H  7.245482 3.093908 -2.709581
H  7.273487 1.334186 -2.5652
H  3.491386 3.420404 -2.730808
H  4.999291 4.270193 -3.036626
H  4.367525 3.167111 -4.236869
H  0.433397 -3.640591 -1.208641
H  -0.151126 -2.280775 -2.155088
H  -2.728921 -3.010084 -1.007135
H  0.282869 -1.333388 1.60336
H  -4.172089 -2.615924 2.473661
H  -4.746384 -2.68538 0.819118
H  -4.592954 -0.679665 3.778091
H  -4.817488 -0.403234 -0.484686
H  -5.445154 1.625031 3.972786
H  -5.67523 1.896369 -0.292862
H  -5.993233 2.923588 1.938125
elementType: O C H
totalener: -1079.75425368 hartree
nucrepener: 2062.89493550 hartree
electener: -3142.64918918 hartree
oneelecener: -5565.22801518 hartree
twoeener: 2422.57882601 hartree
cpcmener: -0.02804642 hartree
kineticenergy: 1074.85456988 hartree
xcener: -106.462309615830 hartree
chargesum: -0.0000000
charge: -0.290193 -0.460275 -0.283020 0.112493 0.039630 -0.093109 -0.268778 -0.277142 -0.280106 0.365894 -0.041539 -0.219933 -0.256312 0.102583 -0.027589 -0.350818 -0.058310 0.209600 -0.061810 0.035839 -0.183424 -0.189671 -0.157501 -0.160320 -0.168370 0.090014 0.089053 0.097093 0.087967 0.097062 0.095296 0.099311 0.091522 0.115896 0.092217 0.093577 0.087691 0.091323 0.092540 0.099264 0.121511 0.114704 0.159945 0.171336 0.107416 0.116067 0.138837 0.142226 0.156093 0.156641 0.157581
qa: -0.2902 -0.4603 -0.2830 0.1125 0.0396 -0.0931 -0.2688 -0.2771 -0.2801 0.3659 -0.0415 -0.2199 -0.2563 0.1026 -0.0276 -0.3508 -0.0583 0.2096 -0.0618 0.0358 -0.1834 -0.1897 -0.1575 -0.1603 -0.1684 0.0900 0.0891 0.0971 0.0880 0.0971 0.0953 0.0993 0.0915 0.1159 0.0922 0.0936 0.0877 0.0913 0.0925 0.0993 0.1215 0.1147 0.1599 0.1713 0.1074 0.1161 0.1388 0.1422 0.1561 0.1566 0.1576
va: 2.1197 2.0367 2.2728 3.6891 3.7867 3.8244 3.9055 3.9007 3.8838 4.2091 3.7508 3.9231 3.9429 3.8275 3.6186 4.0116 3.9540 3.6258 3.8219 3.6054 3.9475 3.9394 3.8983 3.9098 3.8981 1.0346 1.0371 1.0021 1.0058 1.0022 1.0175 1.0018 1.0033 1.0112 0.9956 0.9966 1.0091 1.0090 0.9981 0.9957 0.9907 1.0105 1.0060 0.9964 1.0077 1.0065 1.0045 1.0037 0.9913 0.9914 0.9904
dispcorr: -0.022342291 hartree
energy: -1079.776595970628
dipole: 24.82453 -24.28137 0.54316 15.76251 -16.31088 -0.54837 -5.78305 5.90248 0.11943
magnitude: 0.78102 au
magnitude: 1.98520 debye
