program: Orca
programVersion: 5.0.2
elementType: O O O C C C C C C C C C C C C C C C C C C C C C C H H H H H H H H H H H H H H H H H H H H H H H H H H
charge: 0
multiplicity: 1
keywords: wb97x-d3
keywords: def2-TZVPP
keywords: def2/J RIJCOSX
keywords: DEFGRID2
keywords: scfconv7
keywords: smallprint printgap noloewdin
keywords: NOSOSCF
formula: C22H26O3
InChI: InChI=1/C22H26O3/c1-15(2)10-19-20(22(19,3)4)21(23)25-14-17-12-18(24-13-17)11-16-8-6-5-7-9-16/h5-10,12-13,19-20H,11,14H2,1-4H3
51 atoms
O  1.402417 -2.009882 -0.835093
O  2.238951 -1.245181 1.091352
O  -2.159874 -1.905448 1.743049
C  4.202596 0.150045 -0.980356
C  3.29171 1.142357 -0.319501
C  2.703325 -0.097282 -0.957471
C  4.800908 0.472321 -2.328462
C  5.123712 -0.667643 -0.109158
C  2.995878 2.467209 -0.901765
C  2.108318 -1.14791 -0.106711
C  3.079941 3.646249 -0.276536
C  2.728807 4.918398 -0.988983
C  3.515214 3.830585 1.145316
C  0.745509 -3.090269 -0.149321
C  -0.575943 -2.674321 0.393197
C  -1.832593 -2.698503 -0.294209
C  -0.845476 -2.180512 1.625695
C  -2.758932 -2.225755 0.571825
C  -4.218401 -1.976751 0.454763
C  -4.543577 -0.50334 0.374511
C  -4.263378 0.211179 -0.788215
C  -5.106047 0.167865 1.454358
C  -4.544587 1.566223 -0.871789
C  -5.388119 1.526523 1.374355
C  -5.10906 2.229138 0.211428
H  3.319582 1.103344 0.764126
H  2.209015 0.035057 -1.914224
H  4.104338 0.981889 -2.993271
H  5.12361 -0.44132 -2.831793
H  5.678237 1.112646 -2.213708
H  4.73969 -0.821707 0.8973
H  6.086037 -0.160284 -0.014141
H  5.313892 -1.648398 -0.551033
H  2.670201 2.471635 -1.938175
H  2.40443 4.742513 -2.014782
H  1.926905 5.450664 -0.469795
H  3.582055 5.601577 -1.018079
H  3.811065 2.907479 1.640036
H  4.364501 4.517065 1.197854
H  2.717412 4.28533 1.738874
H  1.390237 -3.494624 0.631347
H  0.618564 -3.860482 -0.908539
H  -2.014782 -3.035372 -1.303192
H  -0.22947 -1.989521 2.490419
H  -4.745572 -2.428061 1.299397
H  -4.570876 -2.486189 -0.44397
H  -3.822694 -0.299534 -1.637116
H  -5.331245 -0.374507 2.365284
H  -4.325373 2.106047 -1.784452
H  -5.828345 2.034997 2.222897
H  -5.330823 3.286749 0.146593
elementType: O C H
totalener: -1079.75503281 hartree
nucrepener: 2065.93085161 hartree
electener: -3145.68588442 hartree
oneelecener: -5571.35936809 hartree
twoeener: 2425.67348367 hartree
cpcmener: -0.02554474 hartree
kineticenergy: 1074.85301456 hartree
xcener: -106.458820157788 hartree
chargesum: 0.0000000
charge: -0.283670 -0.478632 -0.277008 0.101221 0.043365 -0.106318 -0.266876 -0.276006 -0.278463 0.405487 -0.045265 -0.220498 -0.252290 0.089455 -0.086231 -0.330815 -0.012426 0.203704 -0.065573 0.041239 -0.190227 -0.189661 -0.159706 -0.153821 -0.170391 0.087720 0.087702 0.087247 0.097046 0.097261 0.091660 0.096110 0.098070 0.116934 0.088039 0.092548 0.093200 0.090503 0.093832 0.096551 0.118984 0.119656 0.161027 0.168472 0.108590 0.117626 0.141550 0.139422 0.156661 0.155624 0.157371
qa: -0.2837 -0.4786 -0.2770 0.1012 0.0434 -0.1063 -0.2669 -0.2760 -0.2785 0.4055 -0.0453 -0.2205 -0.2523 0.0895 -0.0862 -0.3308 -0.0124 0.2037 -0.0656 0.0412 -0.1902 -0.1897 -0.1597 -0.1538 -0.1704 0.0877 0.0877 0.0872 0.0970 0.0973 0.0917 0.0961 0.0981 0.1169 0.0880 0.0925 0.0932 0.0905 0.0938 0.0966 0.1190 0.1197 0.1610 0.1685 0.1086 0.1176 0.1415 0.1394 0.1567 0.1556 0.1574
va: 2.1252 2.0252 2.2839 3.7043 3.7595 3.8523 3.9086 3.9040 3.8754 4.1853 3.7586 3.9225 3.9428 3.8004 3.6325 4.0197 3.9493 3.6255 3.8216 3.5999 3.9415 3.9528 3.9097 3.8962 3.9001 1.0378 1.0366 1.0059 1.0024 1.0020 1.0191 1.0003 0.9996 1.0107 1.0088 0.9961 0.9963 1.0093 0.9976 0.9967 1.0134 0.9960 1.0066 1.0061 1.0092 1.0060 1.0036 1.0046 0.9914 0.9913 0.9905
dispcorr: -0.021612683 hartree
energy: -1079.776645490355
dipole: 22.33307 -22.40691 -0.07384 18.45091 -18.49709 -0.04618 -6.75582 5.69869 -1.05713
magnitude: 1.06071 au
magnitude: 2.69611 debye
