program: Orca
programVersion: 5.0.2
elementType: O O O C C C C C C C C C C C C C C C C C C C C C C H H H H H H H H H H H H H H H H H H H H H H H H H H
charge: 0
multiplicity: 1
keywords: wb97x-d3
keywords: def2-TZVPP
keywords: def2/J RIJCOSX
keywords: DEFGRID2
keywords: scfconv7
keywords: smallprint printgap noloewdin
keywords: NOSOSCF
formula: C22H26O3
InChI: InChI=1/C22H26O3/c1-15(2)10-19-20(22(19,3)4)21(23)25-14-17-12-18(24-13-17)11-16-8-6-5-7-9-16/h5-10,12-13,19-20H,11,14H2,1-4H3
51 atoms
O  2.113735 -2.030148 0.188178
O  1.620906 -1.782034 -1.975103
O  -1.965515 -1.759219 1.414568
C  3.959763 0.40613 -0.108151
C  2.627242 0.798648 0.427768
C  2.712728 -0.008621 -0.869463
C  4.806653 1.443733 -0.80758
C  4.791024 -0.604882 0.644668
C  2.079485 2.173415 0.415519
C  2.114091 -1.352359 -0.956202
C  0.808253 2.444004 0.728422
C  0.282638 3.844662 0.757277
C  -0.168632 1.354345 1.079554
C  1.226236 -3.155817 0.312429
C  -0.173758 -2.677726 0.480398
C  -1.164569 -2.449788 -0.529312
C  -0.725243 -2.236828 1.636402
C  -2.229006 -1.890529 0.092062
C  -3.521953 -1.354765 -0.406581
C  -3.510487 0.155505 -0.461127
C  -4.13334 0.913964 0.523877
C  -2.833407 0.811272 -1.487091
C  -4.088116 2.302601 0.481925
C  -2.78721 2.196245 -1.532733
C  -3.41691 2.947136 -0.54709
H  2.297976 0.200127 1.272421
H  2.543857 0.553544 -1.781056
H  5.52392 0.962611 -1.475437
H  5.374777 2.029382 -0.081708
H  4.219233 2.138058 -1.40839
H  5.49078 -0.083424 1.301154
H  5.381341 -1.215393 -0.041629
H  4.202004 -1.27268 1.268506
H  2.746694 2.99095 0.159845
H  -0.539365 3.969026 0.047069
H  -0.125441 4.089793 1.741868
H  1.050835 4.580371 0.518176
H  -1.190455 1.731124 1.125156
H  -0.146634 0.540421 0.35184
H  0.053587 0.915778 2.056271
H  1.572456 -3.67819 1.202683
H  1.328947 -3.832382 -0.536125
H  -1.089561 -2.673284 -1.581587
H  -0.363317 -2.204301 2.652822
H  -4.345606 -1.701736 0.222497
H  -3.691116 -1.763598 -1.404152
H  -4.662838 0.41788 1.328955
H  -2.336704 0.231472 -2.25699
H  -4.579565 2.880217 1.254711
H  -2.260292 2.691252 -2.338785
H  -3.384285 4.028636 -0.582923
elementType: O C H
totalener: -1079.74853903 hartree
nucrepener: 2244.57554575 hartree
electener: -3324.32408478 hartree
oneelecener: -5928.48529421 hartree
twoeener: 2604.16120943 hartree
cpcmener: -0.02484630 hartree
kineticenergy: 1074.85914864 hartree
xcener: -106.462578652601 hartree
chargesum: 0.0000000
charge: -0.278981 -0.471945 -0.270292 0.149375 -0.013989 -0.064339 -0.297295 -0.267617 -0.320059 0.372126 0.047209 -0.222580 -0.311767 0.059023 -0.071613 -0.275308 -0.049071 0.173983 -0.058228 0.062346 -0.191347 -0.220250 -0.124948 -0.131792 -0.210324 0.096677 0.088026 0.099881 0.101722 0.087195 0.092303 0.099723 0.091922 0.123080 0.089715 0.101903 0.090419 0.085496 0.081797 0.119514 0.114738 0.119905 0.157111 0.173077 0.109889 0.116331 0.137402 0.139388 0.154815 0.156341 0.159312
qa: -0.2790 -0.4719 -0.2703 0.1494 -0.0140 -0.0643 -0.2973 -0.2676 -0.3201 0.3721 0.0472 -0.2226 -0.3118 0.0590 -0.0716 -0.2753 -0.0491 0.1740 -0.0582 0.0623 -0.1913 -0.2202 -0.1249 -0.1318 -0.2103 0.0967 0.0880 0.0999 0.1017 0.0872 0.0923 0.0997 0.0919 0.1231 0.0897 0.1019 0.0904 0.0855 0.0818 0.1195 0.1147 0.1199 0.1571 0.1731 0.1099 0.1163 0.1374 0.1394 0.1548 0.1563 0.1593
va: 2.0999 2.0332 2.2633 3.7625 3.7625 3.8129 3.9198 3.8720 3.8812 4.1893 3.6555 3.9113 3.9847 3.8593 3.6360 3.9823 3.9191 3.6553 3.8105 3.5482 3.9489 3.9006 3.8540 3.8199 3.8720 1.0252 1.0301 1.0015 0.9986 1.0027 1.0008 1.0003 1.0154 1.0074 0.9970 0.9939 1.0106 1.0158 0.9917 1.0003 0.9999 1.0060 1.0171 0.9952 1.0105 1.0080 1.0061 1.0062 0.9911 0.9905 0.9901
dispcorr: -0.029496780 hartree
energy: -1079.778035811248
dipole: 12.19477 -12.15670 0.03807 15.39907 -15.09264 0.30643 3.14240 -2.09756 1.04484
magnitude: 1.08951 au
magnitude: 2.76932 debye
