program: Gaussian 09
title: 000071630
version: EM64L-G09RevD.01
frameworkgroup: C1[X(C15H24N2O3)]
method: RPBEPBE
basis: SDD
operation: Freq
keyword: #p
keyword: freq=noraman
keyword: PBEPBE/SDD
title: #p freq=noraman PBEPBE/SDD
converged: YES YES NO NO
title: Mulliken charges:
elementType: O O O N N C C C C C C C C C C C C C C C H H H H H H H H H H H H H H H H H H H H H H H H
charge: -0.313794 -0.387630 -0.232788 -0.428499 -0.088301 -0.425342 -0.334322 -0.338786 0.535713 -0.361311 -0.255503 -0.686844 0.110975 -0.643169 -0.396558 0.202169 -0.301258 0.181604 -0.614896 -0.612047 0.204220 0.204652 0.214293 0.214123 0.198626 0.198739 0.298372 0.190387 0.219729 0.236296 0.226130 0.210722 0.221620 0.210710 0.205285 0.242390 0.272221 0.186370 0.221366 0.230984 0.221206 0.186210 0.226946 0.348988
chargesum: 0.00000
title: Mulliken charges with hydrogens summed into heavy atoms:
elementType: O O O N N C C C C C C C C C C C C C C C
charge: -0.313794 -0.038642 -0.232788 -0.130127 -0.088301 -0.016469 0.094093 0.058579 0.535713 0.048804 0.206923 -0.043792 0.110975 -0.437883 -0.154168 0.202169 -0.029038 0.181604 0.023824 0.022315
polarizability: 3.12930835e+02 1.09170453e+01 1.95836673e+02 -1.94006591e+00 2.34545500e+00 1.17178754e+02
1716.lowfreq: -3.9714 -0.0010 0.0007 0.0008 1.4759 7.9126 22.3864 24.6357 30.4143
frequency: 22.2595 24.3831 30.3361 34.2296 43.4109 60.9505 67.5861 79.9570 98.5915 114.2841 130.2549 142.7510 157.2688 188.2845 204.8362 223.4049 227.5701 235.3937 239.7144 245.3003 279.3305 287.0461 340.2423 347.7929 362.8931 389.7985 396.4159 397.9158 431.6777 442.6111 451.1807 486.2486 557.5516 571.7359 624.2397 640.0049 668.4136 739.3657 741.9315 754.1550 765.1695 798.2232 801.2238 808.1869 821.2743 831.5085 900.2260 924.1073 944.9156 952.5704 974.5301 1014.0466 1026.7746 1031.7874 1033.7378 1069.0478 1077.7483 1085.3035 1088.4446 1097.7473 1112.0725 1140.4073 1142.8670 1153.3826 1170.8215 1174.2346 1219.2122 1219.4650 1229.6784 1238.8021 1265.3761 1265.5684 1278.9291 1286.5310 1291.2832 1292.4423 1323.6679 1326.2875 1353.7886 1362.1229 1378.9115 1385.9097 1395.5997 1419.3206 1434.6291 1442.2527 1461.7087 1465.3023 1469.8847 1474.7289 1475.0927 1476.4870 1480.8741 1483.5123 1487.1420 1488.5528 1493.2997 1501.8653 1525.4452 1582.6318 1628.1290 1635.3771 2844.4078 2852.7636 2870.9929 2936.9259 2961.0314 2974.8898 2975.1201 2976.6487 3007.9928 3012.7344 3018.3010 3030.0151 3036.5349 3037.2833 3073.1278 3077.1504 3077.8000 3082.1677 3089.2440 3093.8941 3161.3432 3184.9155 3545.5464 3562.7570
redmass: 3.2532 3.4235 3.5046 4.2094 6.5692 1.7795 4.0068 3.6027 1.9955 2.4617 2.3575 4.0227 3.7199 4.4012 3.4070 1.1316 4.0536 1.5578 1.1671 2.8179 3.4829 3.3506 3.4462 2.6827 1.2118 3.6511 2.1806 1.7427 2.6781 3.1693 2.7709 4.0793 5.6850 5.0859 6.2721 5.9413 2.8689 1.1368 2.4933 6.7234 7.2565 1.3030 1.1782 1.7646 1.6055 4.6484 2.0843 4.6958 1.1531 3.7074 1.3364 7.5466 3.5900 2.2455 1.5780 1.6131 2.2705 2.6697 1.5213 1.9751 2.1860 1.4705 2.8245 1.5476 1.2177 1.4128 1.6563 1.3187 2.0506 2.4038 1.7477 1.7877 1.1417 1.2656 1.0751 1.4838 1.5339 1.4243 1.8699 2.5376 1.7886 1.4721 1.2188 1.1459 4.8109 1.1655 1.0501 1.0666 1.0715 1.0680 1.0670 1.0588 1.0420 1.0663 1.0777 1.0674 1.9909 1.1132 3.5359 4.8754 11.7435 6.6140 1.0573 1.0616 1.0658 1.0571 1.0584 1.0858 1.0746 1.0367 1.1011 1.0576 1.0720 1.0725 1.1043 1.0877 1.1009 1.1021 1.0993 1.1055 1.1016 1.0905 1.0877 1.0957 1.0656 1.0769
irintensity: 1.4043 0.0484 0.7006 0.3731 0.5212 0.9778 1.4649 2.2386 1.8431 1.2309 1.5063 0.7542 1.7134 1.5332 0.9115 0.6526 0.4600 0.6373 0.0707 1.3668 12.6724 0.0357 6.3631 8.0303 115.4404 1.2093 41.1932 53.6556 7.5080 6.8680 11.9590 8.9295 1.5482 27.4353 0.6980 22.2927 28.9769 11.3049 0.1035 0.5756 31.8355 0.1016 3.0526 23.0767 61.7088 9.5360 5.2422 12.1998 0.1846 7.7554 0.7416 377.9743 36.1599 151.2675 17.7637 10.4812 3.8346 89.8746 6.9812 5.6377 123.3847 3.8167 93.4033 0.4344 95.2566 1.7405 42.4717 0.4689 152.0090 222.8932 2.7619 2.9795 0.3305 4.5410 0.6310 63.2072 8.9442 14.0965 49.8508 41.6717 32.0348 8.8007 8.9338 2.4975 10.9895 4.7437 12.8616 7.1694 6.4006 20.4285 0.5311 10.5442 13.4699 13.0231 23.2883 12.1855 142.6670 42.4252 94.1379 48.5941 292.2520 700.8018 73.0187 106.5032 178.8666 45.9978 13.7863 35.0334 49.8933 35.9653 4.6903 19.3917 45.3799 58.3168 51.5573 10.5289 80.4854 16.7108 47.1637 61.5327 42.7166 21.4837 8.6932 6.9168 20.7819 54.1260
temp: 298.150 k
press: 1.00000 atm
elementType: 8 8 8 7 7 6 6 6 6 6 6 6 6 6 6 6 6 6 6 6 1 1 1 1 1 1 1 1 1 1 1 1 1 1 1 1 1 1 1 1 1 1 1 1
symmnumber: 1
zpe: 971637.3 jmol-1
zpe.correction: 0.370077 hartree
zpe.thermalcorrener: 0.393158 hartree
zpe.thermalcorrenthalpy: 0.394102 hartree
zpe.thermalcorrgfe: 0.314473 hartree
zpe.sumelectzpe: -919.591327 hartree
zpe.sumelectthermal: -919.568246 hartree
zpe.sumelectthermalent: -919.567302 hartree
zpe.sumelectthermalfe: -919.646931 hartree
dipole: -6.4876 -2.5677 0.8236
dipole: 7.0257
quadrupole: -91.6715 -115.4851 -124.5241
quadrupole: -17.5605 4.5370 1.2423
quadrupole: 18.8887 -4.9249 -13.9638 -17.5605 4.5370 1.2423
hfenergy: -919.9614036 hartree
pointgroup: C01 [X(C15H24N2O3)]
dipole: 2.5543761 -1.01005 -0.3088839 debye
polarizability: 312.9542592|-10.8579895|195.8120139|-0.9799006|-2.6352402|117.1799887 unknown
InChI: InChI=1S/C15H24N2O3/c1-4-5-8-16-12-6-7-13(14(18)11-12)15(19)20-10-9-17(2)3/h6-7,11,16,18H,4-5,8-10H2,1-3H3
charge 0 multiplicity 1
44 atoms
O  -2.582533 0.010796 0.060183
O  -0.037097 3.48059 -0.055979
O  -2.560858 2.341786 0.050988
N  3.78013 0.45565 -0.079493
N  -6.035276 -1.43612 0.08582
C  5.973895 -0.691359 -0.093325
C  4.441815 -0.854884 -0.060066
C  6.715358 -2.046689 -0.077172
C  2.405442 0.64105 -0.053359
C  -4.561962 -1.353208 -0.048983
C  -4.062251 0.087818 0.117117
C  8.249999 -1.883982 -0.105416
C  -0.447352 1.07918 0.002731
C  1.863063 1.957877 -0.067909
C  1.498043 -0.463594 -0.011829
C  0.470593 2.17793 -0.040252
C  0.118146 -0.228105 0.014719
C  -1.914232 1.266746 0.038383
C  -6.761222 -0.86784 -1.069284
C  -6.491284 -2.805932 0.396831
H  6.297761 -0.087008 0.779356
H  6.263257 -0.126566 -1.003793
H  4.150117 -1.418192 0.852308
H  4.116067 -1.461013 -0.932346
H  6.419566 -2.614913 0.827788
H  6.39063 -2.652038 -0.947408
H  4.378844 1.280977 -0.102587
H  -4.197595 -1.759135 -1.026858
H  -4.106715 -1.967734 0.749183
H  -4.377428 0.504014 1.090349
H  -4.414895 0.766311 -0.679903
H  8.605347 -1.30961 0.770699
H  8.757565 -2.865406 -0.093357
H  8.57668 -1.346445 -1.015417
H  2.543615 2.821099 -0.101129
H  1.874041 -1.489786 0.000447
H  -0.575098 -1.072233 0.047575
H  -6.552861 -1.410558 -2.027385
H  -7.848141 -0.914348 -0.87824
H  -6.492994 0.192514 -1.211707
H  -7.581911 -2.800643 0.574401
H  -6.280808 -3.543656 -0.419888
H  -5.997617 -3.164253 1.317532
H  0.706355 4.13591 -0.083428
