program: Orca
programVersion: 5.0.2
elementType: O O O C C C C C C C C C C C C C C C C C C C C C C H H H H H H H H H H H H H H H H H H H H H H H H H H
charge: 0
multiplicity: 1
keywords: wb97x-d3
keywords: def2-TZVPP
keywords: def2/J RIJCOSX
keywords: DEFGRID2
keywords: scfconv7
keywords: smallprint printgap noloewdin
keywords: NOSOSCF
formula: C22H26O3
InChI: InChI=1/C22H26O3/c1-15(2)10-19-20(22(19,3)4)21(23)25-14-17-12-18(24-13-17)11-16-8-6-5-7-9-16/h5-10,12-13,19-20H,11,14H2,1-4H3
51 atoms
O  1.726696 -2.011407 0.01464
O  1.151076 -1.20404 -1.990063
O  -2.60543 -2.477242 -0.373694
C  1.127495 1.419181 -0.195709
C  2.200298 1.464029 -1.232653
C  2.095963 0.249009 -0.342393
C  1.2817 2.232879 1.06571
C  -0.311366 1.282653 -0.63273
C  3.371733 2.373243 -1.129017
C  1.61798 -1.034096 -0.888175
C  4.575587 2.12845 -1.652848
C  5.69487 3.116672 -1.532733
C  4.910176 0.87148 -2.394936
C  0.976342 -3.214367 -0.223545
C  -0.46751 -2.935136 -0.007281
C  -1.073184 -2.515857 1.221228
C  -1.449449 -2.885363 -0.93644
C  -2.368638 -2.244843 0.939344
C  -3.471566 -1.658133 1.746534
C  -3.47297 -0.150906 1.631994
C  -2.813787 0.625808 2.580582
C  -4.077029 0.482715 0.549223
C  -2.761678 2.007488 2.454579
C  -4.024829 1.864091 0.419744
C  -3.366872 2.63111 1.371949
H  1.846749 1.288838 -2.246244
H  2.820984 0.15995 0.459582
H  0.687067 1.800392 1.873218
H  0.928283 3.255062 0.911694
H  2.314411 2.28669 1.410914
H  -0.906453 0.774511 0.129795
H  -0.428034 0.736866 -1.567064
H  -0.74455 2.273866 -0.781996
H  3.216922 3.317102 -0.613465
H  6.049076 3.432693 -2.51766
H  5.399471 4.008827 -0.980106
H  6.5557 2.674741 -1.023646
H  4.079978 0.169035 -2.450427
H  5.222591 1.09881 -3.417851
H  5.753278 0.357418 -1.925372
H  1.361617 -3.927285 0.504254
H  1.168829 -3.613461 -1.220477
H  -0.594868 -2.414363 2.183321
H  -1.471969 -3.107262 -1.992118
H  -3.332313 -1.950931 2.788023
H  -4.432477 -2.067419 1.426017
H  -2.337158 0.145996 3.427784
H  -4.594615 -0.106192 -0.199112
H  -2.248371 2.596625 3.20421
H  -4.500153 2.342543 -0.427281
H  -3.327547 3.708269 1.271469
elementType: O C H
totalener: -1079.75138958 hartree
nucrepener: 2198.84183308 hartree
electener: -3278.59322266 hartree
oneelecener: -5837.28082844 hartree
twoeener: 2558.68760578 hartree
cpcmener: -0.02443157 hartree
kineticenergy: 1074.85996047 hartree
xcener: -106.461323210587 hartree
chargesum: -0.0000000
charge: -0.286192 -0.463049 -0.273554 0.212178 -0.036803 -0.101263 -0.309125 -0.268465 -0.290335 0.366270 -0.016693 -0.227413 -0.241248 0.094021 -0.058893 -0.349348 -0.029575 0.212300 -0.060208 0.042253 -0.169572 -0.187798 -0.172919 -0.156458 -0.167746 0.103922 0.093038 0.093919 0.100919 0.097304 0.045856 0.100065 0.104776 0.121746 0.094392 0.088707 0.093471 0.079924 0.099800 0.095439 0.119805 0.114685 0.156484 0.172228 0.108064 0.112659 0.136974 0.137763 0.156450 0.155011 0.156233
qa: -0.2862 -0.4630 -0.2736 0.2122 -0.0368 -0.1013 -0.3091 -0.2685 -0.2903 0.3663 -0.0167 -0.2274 -0.2412 0.0940 -0.0589 -0.3493 -0.0296 0.2123 -0.0602 0.0423 -0.1696 -0.1878 -0.1729 -0.1565 -0.1677 0.1039 0.0930 0.0939 0.1009 0.0973 0.0459 0.1001 0.1048 0.1217 0.0944 0.0887 0.0935 0.0799 0.0998 0.0954 0.1198 0.1147 0.1565 0.1722 0.1081 0.1127 0.1370 0.1378 0.1564 0.1550 0.1562
va: 2.1048 2.0356 2.2715 3.6400 3.8481 3.8069 3.9097 3.8857 3.8895 4.2045 3.7111 3.9302 3.9366 3.8433 3.6381 3.9758 3.9498 3.6067 3.8169 3.6023 3.8819 3.9287 3.8687 3.8871 3.8587 1.0256 1.0318 1.0045 0.9986 1.0036 1.0111 1.0238 1.0008 1.0029 0.9960 1.0066 0.9967 1.0175 0.9991 0.9990 0.9918 1.0096 1.0115 0.9992 1.0109 1.0128 1.0044 1.0103 0.9915 0.9918 0.9915
dispcorr: -0.027579120 hartree
energy: -1079.778968702973
dipole: 17.25437 -16.99250 0.26187 17.84435 -17.70066 0.14369 -1.29406 2.44331 1.14925
magnitude: 1.18743 au
magnitude: 3.01821 debye
