program: Orca
programVersion: 5.0.2
elementType: O O O C C C C C C C C C C C C C C C C C C C C C C H H H H H H H H H H H H H H H H H H H H H H H H H H
charge: 0
multiplicity: 1
keywords: wb97x-d3
keywords: def2-TZVPP
keywords: def2/J RIJCOSX
keywords: DEFGRID2
keywords: scfconv7
keywords: smallprint printgap noloewdin
keywords: NOSOSCF
formula: C22H26O3
InChI: InChI=1/C22H26O3/c1-15(2)10-19-20(22(19,3)4)21(23)25-14-17-12-18(24-13-17)11-16-8-6-5-7-9-16/h5-10,12-13,19-20H,11,14H2,1-4H3
51 atoms
O  1.06843 -1.291165 -1.382466
O  2.341029 -2.491089 0.005778
O  -1.766164 -3.384472 1.343708
C  2.266782 1.011133 0.408155
C  2.652465 1.089255 -1.042898
C  2.853413 -0.204334 -0.289165
C  3.143677 1.666736 1.447257
C  0.800093 1.053221 0.764942
C  3.835949 1.847126 -1.502472
C  2.07454 -1.438938 -0.527707
C  3.844274 2.821619 -2.418031
C  5.120259 3.514404 -2.79259
C  2.63012 3.324421 -3.138529
C  0.190087 -2.409064 -1.592212
C  -0.745307 -2.577322 -0.450945
C  -1.742967 -1.643628 -0.021434
C  -0.805635 -3.608511 0.421102
C  -2.326587 -2.181581 1.074834
C  -3.40191 -1.704981 1.987801
C  -3.750705 -0.270752 1.696654
C  -4.892698 0.053503 0.97292
C  -2.903391 0.755745 2.11001
C  -5.186586 1.376777 0.666802
C  -3.191734 2.077195 1.803573
C  -4.335342 2.39152 1.078937
H  1.806675 1.095116 -1.72074
H  3.872662 -0.431264 0.00699
H  2.912292 2.731236 1.526857
H  4.206452 1.575862 1.225587
H  2.97467 1.21891 2.428682
H  0.50946 2.077642 1.007688
H  0.591079 0.437546 1.642523
H  0.151723 0.720787 -0.042897
H  4.783777 1.57819 -1.04398
H  5.316034 3.428368 -3.865002
H  5.063275 4.584662 -2.575542
H  5.982241 3.110657 -2.261053
H  1.70721 2.824574 -2.850049
H  2.4942 4.39373 -2.955312
H  2.745468 3.211122 -4.219901
H  0.759958 -3.320142 -1.779999
H  -0.34841 -2.15667 -2.504901
H  -1.980906 -0.694556 -0.475199
H  -0.251993 -4.530629 0.508133
H  -3.069617 -1.809798 3.025275
H  -4.289792 -2.336155 1.884857
H  -5.559432 -0.73508 0.643764
H  -2.008406 0.518413 2.674164
H  -6.081226 1.612217 0.104196
H  -2.523708 2.863725 2.131421
H  -4.561193 3.422886 0.83961
elementType: O C H
totalener: -1079.75242537 hartree
nucrepener: 2138.12935577 hartree
electener: -3217.88178114 hartree
oneelecener: -5715.12185043 hartree
twoeener: 2497.24006929 hartree
cpcmener: -0.02642880 hartree
kineticenergy: 1074.85616636 hartree
xcener: -106.462516803277 hartree
chargesum: -0.0000000
charge: -0.273900 -0.468475 -0.280668 0.131662 0.064427 -0.135619 -0.271721 -0.299359 -0.294527 0.411926 -0.042553 -0.223003 -0.251694 0.063488 -0.064599 -0.362438 -0.025209 0.210675 -0.011146 0.020889 -0.180100 -0.226517 -0.156327 -0.144250 -0.165333 0.096427 0.091012 0.095454 0.088253 0.098801 0.099592 0.101618 0.087051 0.117772 0.092855 0.093278 0.088035 0.088434 0.095035 0.095482 0.118633 0.118448 0.166485 0.174005 0.108387 0.100913 0.138655 0.149026 0.156842 0.156827 0.157052
qa: -0.2739 -0.4685 -0.2807 0.1317 0.0644 -0.1356 -0.2717 -0.2994 -0.2945 0.4119 -0.0426 -0.2230 -0.2517 0.0635 -0.0646 -0.3624 -0.0252 0.2107 -0.0111 0.0209 -0.1801 -0.2265 -0.1563 -0.1443 -0.1653 0.0964 0.0910 0.0955 0.0883 0.0988 0.0996 0.1016 0.0871 0.1178 0.0929 0.0933 0.0880 0.0884 0.0950 0.0955 0.1186 0.1184 0.1665 0.1740 0.1084 0.1009 0.1387 0.1490 0.1568 0.1568 0.1571
va: 2.1162 2.0344 2.2769 3.7103 3.7203 3.8739 3.9049 3.9090 3.8608 4.1892 3.7564 3.9247 3.9436 3.8600 3.6703 3.9569 3.9782 3.6463 3.8287 3.6140 3.9316 3.9278 3.8987 3.8818 3.9014 1.0257 1.0341 1.0026 1.0057 1.0015 1.0019 0.9986 1.0083 1.0103 0.9961 0.9961 1.0088 1.0107 0.9974 0.9972 1.0063 0.9924 0.9970 0.9978 1.0066 1.0071 1.0046 0.9986 0.9909 0.9921 0.9904
dispcorr: -0.024996744 hartree
energy: -1079.777422112496
dipole: 14.63941 -15.35388 -0.71448 24.12476 -22.79935 1.32541 -6.28257 5.71452 -0.56805
magnitude: 1.60930 au
magnitude: 4.09053 debye
