program: Orca
programVersion: 5.0.2
elementType: O O O C C C C C C C C C C C C C C C C C C C C C C H H H H H H H H H H H H H H H H H H H H H H H H H H
charge: 0
multiplicity: 1
keywords: wb97x-d3
keywords: def2-TZVPP
keywords: def2/J RIJCOSX
keywords: DEFGRID2
keywords: scfconv7
keywords: smallprint printgap noloewdin
keywords: NOSOSCF
formula: C22H26O3
InChI: InChI=1/C22H26O3/c1-15(2)10-19-20(22(19,3)4)21(23)25-14-17-12-18(24-13-17)11-16-8-6-5-7-9-16/h5-10,12-13,19-20H,11,14H2,1-4H3
51 atoms
O  1.683246 -1.761281 0.030583
O  1.806862 0.190469 1.115514
O  -2.768604 -1.970174 -0.31448
C  4.61081 0.258527 -0.3274
C  3.648646 1.199771 -0.988289
C  3.238561 -0.238031 -0.752228
C  5.778735 -0.280227 -1.117457
C  4.93509 0.4675 1.131268
C  3.829595 1.677431 -2.374267
C  2.183138 -0.544439 0.231995
C  3.853359 2.951874 -2.776758
C  4.034512 3.294782 -4.224734
C  3.71737 4.136062 -1.869635
C  0.657824 -2.239432 0.916692
C  -0.701094 -1.825315 0.479201
C  -1.313793 -0.528703 0.525983
C  -1.638012 -2.650771 -0.04313
C  -2.564981 -0.677135 0.032049
C  -3.710365 0.257807 -0.121437
C  -4.761577 0.021315 0.936618
C  -4.697415 0.697175 2.151723
C  -5.78056 -0.905492 0.737624
C  -5.632945 0.455892 3.147501
C  -6.716095 -1.151723 1.733489
C  -6.644794 -0.472416 2.941872
H  3.187939 1.904699 -0.304223
H  3.243483 -0.888764 -1.620137
H  5.524105 -0.508823 -2.151758
H  6.157891 -1.197686 -0.662988
H  6.596645 0.443502 -1.130449
H  4.137381 0.957821 1.684719
H  5.824771 1.09404 1.221288
H  5.15393 -0.481628 1.625467
H  3.95171 0.908304 -3.131723
H  4.909562 3.933123 -4.372921
H  4.156097 2.40855 -4.847572
H  3.176432 3.856684 -4.604093
H  3.565673 3.875681 -0.824247
H  4.611125 4.763581 -1.924964
H  2.881437 4.767467 -2.180899
H  0.864798 -1.922293 1.940128
H  0.743912 -3.325427 0.882917
H  -0.884023 0.390706 0.888547
H  -1.636906 -3.706834 -0.2663
H  -4.148245 0.154758 -1.118026
H  -3.327013 1.276337 -0.047453
H  -3.908331 1.420881 2.320049
H  -5.848804 -1.436391 -0.20456
H  -5.571253 0.993469 4.085103
H  -7.503182 -1.87536 1.563945
H  -7.375244 -0.662824 3.717575
elementType: O C H
totalener: -1079.75496521 hartree
nucrepener: 2034.37222650 hartree
electener: -3114.12719171 hartree
oneelecener: -5508.08842724 hartree
twoeener: 2393.96123553 hartree
cpcmener: -0.02493165 hartree
kineticenergy: 1074.87103659 hartree
xcener: -106.462483209131 hartree
chargesum: -0.0000000
charge: -0.282770 -0.483479 -0.279560 0.111656 0.039144 -0.103043 -0.266422 -0.281473 -0.277448 0.417797 -0.045276 -0.220062 -0.250987 0.071976 -0.090706 -0.297460 -0.037845 0.201195 -0.066978 0.064351 -0.203452 -0.199555 -0.149109 -0.153817 -0.175485 0.090558 0.087519 0.087184 0.096927 0.096444 0.092870 0.095329 0.098726 0.117338 0.091997 0.087569 0.093835 0.089649 0.095424 0.094884 0.118326 0.116487 0.161235 0.173894 0.114623 0.109243 0.140803 0.138830 0.156578 0.155615 0.156920
qa: -0.2828 -0.4835 -0.2796 0.1117 0.0391 -0.1030 -0.2664 -0.2815 -0.2774 0.4178 -0.0453 -0.2201 -0.2510 0.0720 -0.0907 -0.2975 -0.0378 0.2012 -0.0670 0.0644 -0.2035 -0.1996 -0.1491 -0.1538 -0.1755 0.0906 0.0875 0.0872 0.0969 0.0964 0.0929 0.0953 0.0987 0.1173 0.0920 0.0876 0.0938 0.0896 0.0954 0.0949 0.1183 0.1165 0.1612 0.1739 0.1146 0.1092 0.1408 0.1388 0.1566 0.1556 0.1569
va: 2.1254 2.0177 2.2800 3.6877 3.7600 3.8677 3.9095 3.9035 3.8682 4.1403 3.7534 3.9227 3.9431 3.8486 3.6865 4.0186 3.9701 3.6642 3.8266 3.5748 3.9481 3.9601 3.8939 3.8973 3.9045 1.0352 1.0369 1.0055 1.0024 1.0024 1.0194 1.0005 0.9992 1.0105 0.9966 1.0089 0.9959 1.0098 0.9974 0.9971 1.0084 0.9992 1.0190 0.9942 1.0077 1.0103 1.0040 1.0090 0.9907 0.9912 0.9907
dispcorr: -0.021616893 hartree
energy: -1079.776582106985
dipole: 27.01324 -26.52062 0.49262 15.48801 -15.68868 -0.20067 -9.45870 8.88771 -0.57099
magnitude: 0.78037 au
magnitude: 1.98354 debye
