program: Orca
programVersion: 5.0.2
elementType: O O O C C C C C C C C C C C C C C C C C C C C C C H H H H H H H H H H H H H H H H H H H H H H H H H H
charge: 0
multiplicity: 1
keywords: wb97x-d3
keywords: def2-TZVPP
keywords: def2/J RIJCOSX
keywords: DEFGRID2
keywords: scfconv7
keywords: smallprint printgap noloewdin
keywords: NOSOSCF
formula: C22H26O3
InChI: InChI=1/C22H26O3/c1-15(2)10-19-20(22(19,3)4)21(23)25-14-17-12-18(24-13-17)11-16-8-6-5-7-9-16/h5-10,12-13,19-20H,11,14H2,1-4H3
51 atoms
O  1.704217 -2.114295 0.004207
O  1.126007 -1.100487 -1.904484
O  -2.322017 -2.882693 1.419801
C  1.64574 1.37258 0.026668
C  2.650117 1.309346 -1.089349
C  2.392559 0.07784 -0.252506
C  1.992323 2.077472 1.315992
C  0.182253 1.49255 -0.325967
C  3.974589 1.956182 -1.012568
C  1.681287 -1.07849 -0.830876
C  4.584953 2.644408 -1.982769
C  5.957465 3.210969 -1.771506
C  4.00802 2.902686 -3.342041
C  0.879391 -3.254295 -0.297709
C  -0.523033 -2.999458 0.126599
C  -1.547134 -2.26753 -0.559924
C  -1.060433 -3.34458 1.320615
C  -2.612939 -2.223607 0.273171
C  -3.923032 -1.52457 0.19536
C  -3.854095 -0.179088 0.880714
C  -4.001639 -0.073984 2.261342
C  -3.581813 0.9714 0.145876
C  -3.87331 1.154922 2.894229
C  -3.456082 2.202269 0.776061
C  -3.597972 2.296976 2.15369
H  2.203243 1.270657 -2.076813
H  3.143082 -0.177892 0.488086
H  1.352405 1.722845 2.126531
H  1.833021 3.153632 1.21918
H  3.025069 1.921441 1.625348
H  -0.103777 2.546038 -0.358293
H  -0.44002 1.008864 0.430109
H  -0.06663 1.060293 -1.29316
H  4.5090 1.833342 -0.074653
H  6.658859 2.829663 -2.518938
H  5.956243 4.299108 -1.878929
H  6.356477 2.971037 -0.785812
H  2.953372 2.648037 -3.429784
H  4.113704 3.957058 -3.609003
H  4.549674 2.33753 -4.105845
H  1.312262 -4.071072 0.277805
H  0.949502 -3.513624 -1.354374
H  -1.494469 -1.827421 -1.5425
H  -0.676799 -3.903648 2.160438
H  -4.707308 -2.140755 0.641878
H  -4.180208 -1.393128 -0.856403
H  -4.21956 -0.958335 2.848848
H  -3.463541 0.904341 -0.929598
H  -3.989326 1.220767 3.968764
H  -3.245679 3.08765 0.189375
H  -3.497571 3.25522 2.64725
elementType: O C H
totalener: -1079.75366346 hartree
nucrepener: 2147.20256589 hartree
electener: -3226.95622935 hartree
oneelecener: -5733.84642324 hartree
twoeener: 2506.89019390 hartree
cpcmener: -0.02481457 hartree
kineticenergy: 1074.85988593 hartree
xcener: -106.460944716613 hartree
chargesum: -0.0000000
charge: -0.279883 -0.468856 -0.275783 0.127054 0.039812 -0.095268 -0.274012 -0.295150 -0.279247 0.398894 -0.045735 -0.218780 -0.258308 0.069455 -0.057220 -0.358753 -0.040340 0.234928 -0.052288 0.088488 -0.207877 -0.244186 -0.148912 -0.152520 -0.166731 0.088226 0.089474 0.097527 0.097332 0.089133 0.101283 0.091990 0.094583 0.114471 0.092154 0.093118 0.087561 0.091839 0.092361 0.100024 0.117431 0.118538 0.158988 0.174042 0.114093 0.107143 0.139345 0.139069 0.156366 0.157891 0.157234
qa: -0.2799 -0.4689 -0.2758 0.1271 0.0398 -0.0953 -0.2740 -0.2952 -0.2792 0.3989 -0.0457 -0.2188 -0.2583 0.0695 -0.0572 -0.3588 -0.0403 0.2349 -0.0523 0.0885 -0.2079 -0.2442 -0.1489 -0.1525 -0.1667 0.0882 0.0895 0.0975 0.0973 0.0891 0.1013 0.0920 0.0946 0.1145 0.0922 0.0931 0.0876 0.0918 0.0924 0.1000 0.1174 0.1185 0.1590 0.1740 0.1141 0.1071 0.1393 0.1391 0.1564 0.1579 0.1572
va: 2.1220 2.0384 2.2792 3.6925 3.7789 3.8216 3.9013 3.9040 3.8853 4.2034 3.7602 3.9223 3.9412 3.8535 3.6566 3.9714 3.9722 3.5965 3.8117 3.5444 3.9669 3.9163 3.9001 3.8491 3.8981 1.0350 1.0355 1.0021 1.0017 1.0065 1.0019 0.9948 1.0172 1.0121 0.9954 0.9965 1.0092 1.0086 0.9980 0.9953 0.9969 1.0081 1.0198 0.9943 1.0107 1.0111 1.0108 1.0057 0.9907 0.9903 0.9900
dispcorr: -0.024940413 hartree
energy: -1079.778603871610
dipole: 17.52299 -17.35113 0.17186 21.92776 -21.72348 0.20429 -5.59423 6.21496 0.62073
magnitude: 0.67570 au
magnitude: 1.71750 debye
