program: Orca
programVersion: 5.0.2
elementType: O O O C C C C C C C C C C C C C C C C C C C C C C H H H H H H H H H H H H H H H H H H H H H H H H H H
charge: 0
multiplicity: 1
keywords: wb97x-d3
keywords: def2-TZVPP
keywords: def2/J RIJCOSX
keywords: DEFGRID2
keywords: scfconv7
keywords: smallprint printgap noloewdin
keywords: NOSOSCF
formula: C22H26O3
InChI: InChI=1/C22H26O3/c1-15(2)10-19-20(22(19,3)4)21(23)25-14-17-12-18(24-13-17)11-16-8-6-5-7-9-16/h5-10,12-13,19-20H,11,14H2,1-4H3
51 atoms
O  1.743273 -2.103759 -0.1079
O  1.025943 -1.118009 -1.983817
O  -2.168034 -2.816857 1.602291
C  1.665996 1.380983 -0.132049
C  2.596899 1.307993 -1.30971
C  2.401661 0.08699 -0.441667
C  2.091655 2.105139 1.122415
C  0.181712 1.488448 -0.387568
C  3.915029 1.97361 -1.322415
C  1.655868 -1.079444 -0.952727
C  4.444506 2.67813 -2.328063
C  5.813415 3.277982 -2.206305
C  3.769798 2.932929 -3.64194
C  0.901244 -3.249339 -0.330457
C  -0.469221 -2.986504 0.184533
C  -1.549959 -2.297353 -0.458615
C  -0.912748 -3.275649 1.43069
C  -2.551429 -2.220543 0.448401
C  -3.878107 -1.550738 0.432783
C  -3.818642 -0.225058 1.155236
C  -3.493159 0.937443 0.461726
C  -4.02956 -0.150226 2.528958
C  -3.382493 2.151219 1.125705
C  -3.916026 1.062113 3.196387
C  -3.591643 2.216591 2.496804
H  2.089663 1.253158 -2.266953
H  3.1998 -0.154396 0.252435
H  1.918199 3.1789 1.022598
H  3.14372 1.960598 1.365346
H  1.508956 1.756408 1.977549
H  -0.385241 1.006172 0.411781
H  -0.128691 1.047744 -1.332842
H  -0.113205 2.539842 -0.407565
H  4.513836 1.858898 -0.423302
H  5.776268 4.366573 -2.303105
H  6.285439 3.042024 -1.252414
H  6.471446 2.921587 -3.003805
H  3.817062 3.993956 -3.897382
H  4.281289 2.400645 -4.448134
H  2.722882 2.63813 -3.663882
H  1.375292 -4.054857 0.228793
H  0.89844 -3.529184 -1.38445
H  -1.575185 -1.907863 -1.463418
H  -0.460226 -3.785961 2.267234
H  -4.634824 -2.196723 0.885125
H  -4.169765 -1.397787 -0.60712
H  -3.322639 0.893577 -0.607974
H  -4.287687 -1.045272 3.082999
H  -3.131893 3.046717 0.571076
H  -4.082448 1.104878 4.265309
H  -3.503986 3.161996 3.016721
elementType: O C H
totalener: -1079.75379144 hartree
nucrepener: 2142.76071308 hartree
electener: -3222.51450452 hartree
oneelecener: -5724.93848215 hartree
twoeener: 2502.42397763 hartree
cpcmener: -0.02492042 hartree
kineticenergy: 1074.86317540 hartree
xcener: -106.461619050721 hartree
chargesum: 0.0000000
charge: -0.279490 -0.469105 -0.276106 0.127570 0.037899 -0.094577 -0.274629 -0.299838 -0.281219 0.397910 -0.044335 -0.219488 -0.256802 0.068328 -0.055989 -0.359161 -0.038535 0.228291 -0.052375 0.104369 -0.264215 -0.209191 -0.142516 -0.148081 -0.172706 0.088584 0.089136 0.097062 0.088970 0.098083 0.097667 0.095123 0.101722 0.115315 0.093304 0.087713 0.092456 0.092310 0.099351 0.091385 0.117757 0.118551 0.158534 0.173244 0.113934 0.108947 0.142926 0.139468 0.159026 0.156298 0.157127
qa: -0.2795 -0.4691 -0.2761 0.1276 0.0379 -0.0946 -0.2746 -0.2998 -0.2812 0.3979 -0.0443 -0.2195 -0.2568 0.0683 -0.0560 -0.3592 -0.0385 0.2283 -0.0524 0.1044 -0.2642 -0.2092 -0.1425 -0.1481 -0.1727 0.0886 0.0891 0.0971 0.0890 0.0981 0.0977 0.0951 0.1017 0.1153 0.0933 0.0877 0.0925 0.0923 0.0994 0.0914 0.1178 0.1186 0.1585 0.1732 0.1139 0.1089 0.1429 0.1395 0.1590 0.1563 0.1571
va: 2.1222 2.0381 2.2791 3.6915 3.7805 3.8251 3.9012 3.9065 3.8824 4.2042 3.7568 3.9222 3.9414 3.8550 3.6492 3.9767 3.9724 3.6034 3.8131 3.5156 3.9263 3.9723 3.8501 3.8958 3.9077 1.0349 1.0356 1.0019 1.0065 1.0020 0.9922 1.0175 1.0018 1.0117 0.9964 1.0091 0.9955 0.9980 0.9956 1.0090 0.9968 1.0080 1.0196 0.9944 1.0095 1.0105 1.0033 1.0093 0.9894 0.9906 0.9902
dispcorr: -0.024801827 hartree
energy: -1079.778593267140
dipole: 16.93931 -16.72837 0.21094 22.04907 -21.83259 0.21649 -7.04850 7.64992 0.60142
magnitude: 0.67310 au
magnitude: 1.71089 debye
