program: Orca
programVersion: 5.0.2
elementType: O O O C C C C C C C C C C C C C C C C C C C C C C H H H H H H H H H H H H H H H H H H H H H H H H H H
charge: 0
multiplicity: 1
keywords: wb97x-d3
keywords: def2-TZVPP
keywords: def2/J RIJCOSX
keywords: DEFGRID2
keywords: scfconv7
keywords: smallprint printgap noloewdin
keywords: NOSOSCF
formula: C22H26O3
InChI: InChI=1/C22H26O3/c1-15(2)10-19-20(22(19,3)4)21(23)25-14-17-12-18(24-13-17)11-16-8-6-5-7-9-16/h5-10,12-13,19-20H,11,14H2,1-4H3
51 atoms
O  1.375058 -1.355348 0.928034
O  1.740739 -1.613538 -1.26087
O  -2.538545 -2.350329 -1.014075
C  2.10607 1.535075 -0.874619
C  3.380293 0.854938 -1.292091
C  2.59565 0.31098 -0.120509
C  2.168742 2.846283 -0.129793
C  0.903656 1.428253 -1.780594
C  4.712916 1.447479 -1.058005
C  1.880132 -0.975432 -0.244946
C  5.701044 1.531928 -1.954468
C  7.027581 2.124509 -1.584974
C  5.600864 1.028294 -3.366394
C  0.544256 -2.525265 0.947748
C  -0.785149 -2.259024 0.338393
C  -1.767672 -1.314395 0.783348
C  -1.311454 -2.848675 -0.757939
C  -2.809788 -1.41184 -0.076374
C  -4.114962 -0.704755 -0.193488
C  -4.451891 0.050973 1.062486
C  -5.042533 -0.606018 2.139138
C  -4.160531 1.405835 1.182262
C  -5.342586 0.077955 3.307885
C  -4.457502 2.093759 2.352087
C  -5.051295 1.431917 3.417366
H  3.287132 0.262577 -2.196171
H  2.98596 0.513393 0.871621
H  1.244414 3.014284 0.426495
H  2.288214 3.677974 -0.82757
H  2.991247 2.891945 0.582872
H  -0.023988 1.429848 -1.203118
H  0.910369 0.533496 -2.40034
H  0.871652 2.286955 -2.45454
H  4.901111 1.830181 -0.059032
H  7.24644 3.007194 -2.192064
H  7.072469 2.418181 -0.536005
H  7.839908 1.41605 -1.770564
H  6.220051 1.628371 -4.035662
H  5.965079 -0.000016 -3.444896
H  4.585162 1.045669 -3.759405
H  0.447723 -2.767787 2.005609
H  1.042334 -3.36403 0.458005
H  -1.694936 -0.656677 1.635463
H  -0.942777 -3.611545 -1.426453
H  -4.901317 -1.43263 -0.413067
H  -4.087346 -0.018472 -1.045979
H  -5.273033 -1.662304 2.059558
H  -3.69994 1.929901 0.352735
H  -5.807653 -0.445811 4.13353
H  -4.227196 3.148887 2.429002
H  -5.288708 1.967545 4.32775
elementType: O C H
totalener: -1079.75421634 hartree
nucrepener: 2083.27154016 hartree
electener: -3163.02575650 hartree
oneelecener: -5605.78881722 hartree
twoeener: 2442.76306072 hartree
cpcmener: -0.02521979 hartree
kineticenergy: 1074.85284300 hartree
xcener: -106.460272943912 hartree
chargesum: -0.0000000
charge: -0.281237 -0.463658 -0.279673 0.109927 0.040037 -0.101334 -0.271313 -0.273315 -0.296461 0.384052 -0.020125 -0.220624 -0.276256 0.091203 -0.075799 -0.333714 -0.028647 0.188514 -0.003082 0.002125 -0.194628 -0.183208 -0.150662 -0.157220 -0.165134 0.088958 0.091547 0.097000 0.097226 0.087595 0.093622 0.092062 0.097779 0.115713 0.092374 0.085600 0.095507 0.093357 0.106123 0.096121 0.120866 0.116416 0.159039 0.173302 0.107597 0.103300 0.139581 0.138918 0.156115 0.156443 0.158072
qa: -0.2812 -0.4637 -0.2797 0.1099 0.0400 -0.1013 -0.2713 -0.2733 -0.2965 0.3841 -0.0201 -0.2206 -0.2763 0.0912 -0.0758 -0.3337 -0.0286 0.1885 -0.0031 0.0021 -0.1946 -0.1832 -0.1507 -0.1572 -0.1651 0.0890 0.0915 0.0970 0.0972 0.0876 0.0936 0.0921 0.0978 0.1157 0.0924 0.0856 0.0955 0.0934 0.1061 0.0961 0.1209 0.1164 0.1590 0.1733 0.1076 0.1033 0.1396 0.1389 0.1561 0.1564 0.1581
va: 2.1154 2.0437 2.2759 3.6954 3.7774 3.8270 3.9068 3.9043 3.9008 4.2219 3.7212 3.9272 3.9428 3.8383 3.6570 3.9606 3.9672 3.6631 3.8069 3.6315 3.9365 3.9216 3.8946 3.9000 3.8937 1.0337 1.0348 1.0019 1.0020 1.0056 1.0015 1.0173 1.0015 1.0108 0.9954 1.0098 0.9939 0.9999 0.9937 1.0022 0.9896 1.0078 1.0068 0.9981 1.0083 1.0045 1.0035 1.0053 0.9910 0.9911 0.9900
dispcorr: -0.022821869 hartree
energy: -1079.777038210538
dipole: 22.38910 -22.46866 -0.07956 17.75633 -17.06781 0.68852 -7.62265 8.34202 0.71938
magnitude: 0.99894 au
magnitude: 2.53911 debye
