program: Orca
programVersion: 5.0.2
elementType: O O O C C C C C C C C C C C C C C C C C C C C C C H H H H H H H H H H H H H H H H H H H H H H H H H H
charge: 0
multiplicity: 1
keywords: wb97x-d3
keywords: def2-TZVPP
keywords: def2/J RIJCOSX
keywords: DEFGRID2
keywords: scfconv7
keywords: smallprint printgap noloewdin
keywords: NOSOSCF
formula: C22H26O3
InChI: InChI=1/C22H26O3/c1-15(2)10-19-20(22(19,3)4)21(23)25-14-17-12-18(24-13-17)11-16-8-6-5-7-9-16/h5-10,12-13,19-20H,11,14H2,1-4H3
51 atoms
O  1.699537 -2.133751 -0.026803
O  1.127006 -1.120423 -1.937659
O  -2.334543 -2.723369 1.42765
C  1.74011 1.343096 -0.01358
C  2.720799 1.259741 -1.150006
C  2.449998 0.032515 -0.310819
C  2.124864 2.033074 1.272861
C  0.272921 1.495424 -0.337782
C  4.062083 1.873136 -1.095871
C  1.696769 -1.105784 -0.871573
C  4.686216 2.526407 -2.081465
C  6.073758 3.060913 -1.884609
C  4.113484 2.777215 -3.443293
C  0.836973 -3.251234 -0.304891
C  -0.554098 -2.945739 0.122698
C  -1.570182 -2.226735 -0.588926
C  -1.08495 -3.218325 1.33816
C  -2.625501 -2.118993 0.251283
C  -3.928865 -1.413281 0.148548
C  -3.905047 -0.119962 0.929734
C  -4.266482 -0.08997 2.273336
C  -3.464458 1.055392 0.32712
C  -4.188267 1.09082 3.000161
C  -3.389189 2.237764 1.049981
C  -3.749254 2.258288 2.39094
H  2.253253 1.236008 -2.128346
H  3.208365 -0.243442 0.414369
H  1.490775 1.687973 2.092089
H  1.988767 3.113143 1.185323
H  3.158631 1.851705 1.564673
H  0.000266 1.087823 -1.309323
H  0.004098 2.553875 -0.342939
H  -0.344428 1.006366 0.41877
H  4.599222 1.753767 -0.159048
H  6.101731 4.145791 -2.017814
H  6.467738 2.833757 -0.893968
H  6.763249 2.643336 -2.623567
H  3.063533 2.508069 -3.539462
H  4.206706 3.833077 -3.709338
H  4.668261 2.220903 -4.203882
H  1.248657 -4.07159 0.280974
H  0.891027 -3.529773 -1.357629
H  -1.519375 -1.839948 -1.593765
H  -0.701898 -3.739759 2.202137
H  -4.738562 -2.055901 0.503844
H  -4.121618 -1.211552 -0.905898
H  -4.61532 -0.99484 2.757301
H  -3.17455 1.045287 -0.717559
H  -4.472985 1.098816 4.044764
H  -3.04736 3.14357 0.565011
H  -3.690769 3.179235 2.956928
elementType: O C H
totalener: -1079.75390382 hartree
nucrepener: 2139.90287442 hartree
electener: -3219.65677824 hartree
oneelecener: -5719.20439988 hartree
twoeener: 2499.54762164 hartree
cpcmener: -0.02496730 hartree
kineticenergy: 1074.86576252 hartree
xcener: -106.462006072853 hartree
chargesum: -0.0000000
charge: -0.279080 -0.468457 -0.276168 0.124518 0.034135 -0.088382 -0.274922 -0.299268 -0.276126 0.395679 -0.049856 -0.218548 -0.255456 0.067329 -0.056583 -0.356257 -0.036866 0.222970 -0.051621 0.106824 -0.207621 -0.269420 -0.148922 -0.138250 -0.174521 0.088952 0.089439 0.097888 0.097325 0.088824 0.094585 0.101824 0.099278 0.114412 0.092915 0.087674 0.092202 0.090793 0.092715 0.098784 0.118139 0.118745 0.157854 0.173362 0.113960 0.109036 0.139201 0.144965 0.156061 0.158677 0.157258
qa: -0.2791 -0.4685 -0.2762 0.1245 0.0341 -0.0884 -0.2749 -0.2993 -0.2761 0.3957 -0.0499 -0.2185 -0.2555 0.0673 -0.0566 -0.3563 -0.0369 0.2230 -0.0516 0.1068 -0.2076 -0.2694 -0.1489 -0.1382 -0.1745 0.0890 0.0894 0.0979 0.0973 0.0888 0.0946 0.1018 0.0993 0.1144 0.0929 0.0877 0.0922 0.0908 0.0927 0.0988 0.1181 0.1187 0.1579 0.1734 0.1140 0.1090 0.1392 0.1450 0.1561 0.1587 0.1573
va: 2.1215 2.0394 2.2793 3.6958 3.7855 3.8083 3.9013 3.9076 3.8823 4.2103 3.7667 3.9215 3.9409 3.8546 3.6461 3.9790 3.9715 3.6103 3.8141 3.5119 3.9725 3.9307 3.8950 3.8543 3.9099 1.0339 1.0353 1.0019 1.0017 1.0068 1.0173 1.0018 0.9917 1.0122 0.9966 1.0092 0.9957 1.0096 0.9977 0.9957 0.9968 1.0078 1.0201 0.9943 1.0085 1.0103 1.0086 1.0018 0.9908 0.9895 0.9902
dispcorr: -0.024705338 hartree
energy: -1079.778609162432
dipole: 18.16598 -17.97539 0.19058 21.25847 -21.07093 0.18754 -5.91337 6.52421 0.61084
magnitude: 0.66680 au
magnitude: 1.69486 debye
