program: Orca
programVersion: 5.0.2
elementType: O O O C C C C C C C C C C C C C C C C C C C C C C H H H H H H H H H H H H H H H H H H H H H H H H H H
charge: 0
multiplicity: 1
keywords: wb97x-d3
keywords: def2-TZVPP
keywords: def2/J RIJCOSX
keywords: DEFGRID2
keywords: scfconv7
keywords: smallprint printgap noloewdin
keywords: NOSOSCF
formula: C22H26O3
InChI: InChI=1/C22H26O3/c1-15(2)10-19-20(22(19,3)4)21(23)25-14-17-12-18(24-13-17)11-16-8-6-5-7-9-16/h5-10,12-13,19-20H,11,14H2,1-4H3
51 atoms
O  1.703581 -2.122762 -0.063272
O  1.336775 -0.299517 1.177421
O  -2.512605 -2.966002 -0.926487
C  3.997534 0.658904 -0.203967
C  2.817606 1.289559 -0.877256
C  2.843865 -0.208826 -0.680942
C  5.283152 0.517388 -0.981077
C  4.218353 0.917612 1.265436
C  2.879622 1.839969 -2.2539
C  1.890091 -0.842936 0.249787
C  2.96825 3.137722 -2.557642
C  2.985989 3.604061 -3.98132
C  3.055475 4.225311 -1.531746
C  0.756465 -2.890263 0.699932
C  -0.634334 -2.678508 0.217644
C  -1.555731 -1.634233 0.560603
C  -1.278955 -3.451882 -0.686945
C  -2.676549 -1.857286 -0.165787
C  -3.96847 -1.130232 -0.306515
C  -4.203331 -0.192439 0.845842
C  -3.766346 1.127409 0.793595
C  -4.838607 -0.643956 1.999593
C  -3.962505 1.980453 1.872156
C  -5.040446 0.206535 3.076896
C  -4.601105 1.522656 3.016275
H  2.151371 1.812586 -0.1970
H  3.062035 -0.799568 -1.564468
H  5.914153 -0.259827 -0.545199
H  5.847451 1.452367 -0.957771
H  5.117677 0.259408 -2.027018
H  3.301664 1.144839 1.805046
H  4.886825 1.772687 1.387251
H  4.692608 0.061821 1.750963
H  2.839834 1.12282 -3.069234
H  2.154226 4.285439 -4.180891
H  3.900214 4.161176 -4.202762
H  2.916569 2.776496 -4.687556
H  3.107644 3.853037 -0.509613
H  3.942635 4.84064 -1.703785
H  2.197325 4.899497 -1.600494
H  0.853693 -2.669984 1.763545
H  1.056982 -3.925494 0.544375
H  -1.397658 -0.830443 1.260986
H  -0.995756 -4.349405 -1.215833
H  -4.785612 -1.853733 -0.371216
H  -3.97601 -0.573666 -1.249394
H  -3.269679 1.492936 -0.097891
H  -5.182384 -1.670599 2.053271
H  -3.618075 3.005393 1.81643
H  -5.542906 -0.158439 3.96379
H  -4.758175 2.188188 3.855469
elementType: O C H
totalener: -1079.75337070 hartree
nucrepener: 2079.35846735 hartree
electener: -3159.11183805 hartree
oneelecener: -5598.23743964 hartree
twoeener: 2439.12560159 hartree
cpcmener: -0.02440062 hartree
kineticenergy: 1074.85962144 hartree
xcener: -106.459805369152 hartree
chargesum: -0.0000000
charge: -0.283876 -0.480372 -0.277772 0.146388 -0.011326 -0.118008 -0.266450 -0.297162 -0.260785 0.420758 -0.033428 -0.228994 -0.250587 0.070254 -0.114339 -0.264254 -0.034669 0.168628 0.001401 0.004052 -0.192953 -0.195371 -0.150352 -0.149332 -0.168512 0.098648 0.087596 0.098377 0.095006 0.090050 0.094177 0.094134 0.100131 0.119522 0.094297 0.093348 0.088848 0.087812 0.094212 0.099236 0.117183 0.119139 0.160796 0.174937 0.104283 0.104314 0.140907 0.138819 0.156696 0.156623 0.157969
qa: -0.2839 -0.4804 -0.2778 0.1464 -0.0113 -0.1180 -0.2664 -0.2972 -0.2608 0.4208 -0.0334 -0.2290 -0.2506 0.0703 -0.1143 -0.2643 -0.0347 0.1686 0.0014 0.0041 -0.1930 -0.1954 -0.1504 -0.1493 -0.1685 0.0986 0.0876 0.0984 0.0950 0.0900 0.0942 0.0941 0.1001 0.1195 0.0943 0.0933 0.0888 0.0878 0.0942 0.0992 0.1172 0.1191 0.1608 0.1749 0.1043 0.1043 0.1409 0.1388 0.1567 0.1566 0.1580
va: 2.1256 2.0249 2.2797 3.6600 3.7802 3.8890 3.9071 3.8975 3.8694 4.1534 3.7039 3.9278 3.9427 3.8489 3.7185 3.9600 3.9670 3.7138 3.8144 3.6343 3.9228 3.9434 3.8958 3.8944 3.8976 1.0253 1.0378 1.0028 1.0027 1.0027 1.0197 1.0009 0.9993 1.0079 0.9951 0.9966 1.0080 1.0078 0.9981 0.9980 1.0089 0.9974 1.0147 0.9942 1.0105 1.0024 1.0041 1.0040 0.9908 0.9907 0.9902
dispcorr: -0.022419323 hartree
energy: -1079.775790026767
dipole: 22.98247 -22.50743 0.47504 20.44928 -20.50048 -0.05120 -7.44045 6.81292 -0.62753
magnitude: 0.78872 au
magnitude: 2.00476 debye
