program: Orca
programVersion: 5.0.2
elementType: O O O C C C C C C C C C C C C C C C C C C C C C C H H H H H H H H H H H H H H H H H H H H H H H H H H
charge: 0
multiplicity: 1
keywords: wb97x-d3
keywords: def2-TZVPP
keywords: def2/J RIJCOSX
keywords: DEFGRID2
keywords: scfconv7
keywords: smallprint printgap noloewdin
keywords: NOSOSCF
formula: C22H26O3
InChI: InChI=1/C22H26O3/c1-15(2)10-19-20(22(19,3)4)21(23)25-14-17-12-18(24-13-17)11-16-8-6-5-7-9-16/h5-10,12-13,19-20H,11,14H2,1-4H3
51 atoms
O  1.048593 -1.048599 -1.444423
O  2.354668 -2.625289 -0.551029
O  -1.363984 -2.605889 1.854212
C  3.00794 0.762569 0.19732
C  3.124786 0.961284 -1.287625
C  3.207468 -0.432763 -0.720602
C  4.18007 1.1211 1.076245
C  1.673142 1.005676 0.858913
C  4.337025 1.552386 -1.90802
C  2.176921 -1.477262 -0.890695
C  4.452179 2.815661 -2.326747
C  5.717515 3.313078 -2.957043
C  3.360636 3.834266 -2.207936
C  -0.058567 -1.96442 -1.505755
C  -0.773021 -2.030249 -0.202805
C  -1.833148 -1.172243 0.238075
C  -0.534206 -2.876564 0.826643
C  -2.155499 -1.568771 1.49198
C  -3.152591 -1.096843 2.491964
C  -4.200068 -0.224913 1.855192
C  -4.112685 1.161544 1.916732
C  -5.265843 -0.800482 1.166975
C  -5.072921 1.95965 1.306993
C  -6.226861 -0.007238 0.558531
C  -6.132693 1.377324 0.626893
H  2.187178 1.208954 -1.775412
H  4.201745 -0.865336 -0.668912
H  4.182782 2.191949 1.292257
H  5.138894 0.875491 0.620232
H  4.122472 0.592586 2.030085
H  1.640072 2.023296 1.254111
H  1.516422 0.32489 1.698703
H  0.830109 0.898987 0.179269
H  5.194122 0.894691 -2.024574
H  5.532254 3.695535 -3.964511
H  6.140189 4.144035 -2.385712
H  6.476791 2.53408 -3.028399
H  3.059884 4.201301 -3.193075
H  2.470671 3.458881 -1.705138
H  3.711388 4.70677 -1.65015
H  0.277769 -2.948168 -1.833433
H  -0.708476 -1.558478 -2.279053
H  -2.294159 -0.374542 -0.323361
H  0.155375 -3.694573 0.963553
H  -2.645715 -0.549331 3.29282
H  -3.624963 -1.962501 2.965245
H  -3.288372 1.623136 2.44785
H  -5.344966 -1.880121 1.109294
H  -4.992538 3.037705 1.366473
H  -7.052188 -0.469804 0.032084
H  -6.883509 1.997671 0.154164
elementType: O C H
totalener: -1079.75160336 hartree
nucrepener: 2088.53082497 hartree
electener: -3168.28242833 hartree
oneelecener: -5615.89150682 hartree
twoeener: 2447.60907849 hartree
cpcmener: -0.02436991 hartree
kineticenergy: 1074.85889171 hartree
xcener: -106.460699585932 hartree
chargesum: 0.0000000
charge: -0.273600 -0.471682 -0.278802 0.153640 0.022420 -0.140024 -0.269893 -0.312895 -0.282000 0.403887 -0.029902 -0.229665 -0.253169 0.063295 -0.090985 -0.318867 -0.008558 0.187849 -0.004128 -0.001384 -0.179509 -0.196184 -0.157075 -0.148610 -0.166905 0.102964 0.091604 0.094341 0.090588 0.099032 0.098087 0.106582 0.092047 0.119028 0.093897 0.093782 0.088784 0.098931 0.087187 0.095352 0.121798 0.116865 0.160649 0.169733 0.102141 0.107661 0.139710 0.140338 0.156676 0.156538 0.158429
qa: -0.2736 -0.4717 -0.2788 0.1536 0.0224 -0.1400 -0.2699 -0.3129 -0.2820 0.4039 -0.0299 -0.2297 -0.2532 0.0633 -0.0910 -0.3189 -0.0086 0.1878 -0.0041 -0.0014 -0.1795 -0.1962 -0.1571 -0.1486 -0.1669 0.1030 0.0916 0.0943 0.0906 0.0990 0.0981 0.1066 0.0920 0.1190 0.0939 0.0938 0.0888 0.0989 0.0872 0.0954 0.1218 0.1169 0.1606 0.1697 0.1021 0.1077 0.1397 0.1403 0.1567 0.1565 0.1584
va: 2.1117 2.0282 2.2793 3.6574 3.7528 3.8984 3.9033 3.9095 3.8576 4.2042 3.7060 3.9284 3.9437 3.8234 3.6660 3.9591 3.9546 3.6535 3.8075 3.6394 3.9216 3.9351 3.9002 3.8922 3.8952 1.0182 1.0347 1.0026 1.0030 1.0023 1.0032 0.9973 1.0115 1.0083 0.9953 0.9963 1.0079 0.9979 1.0082 0.9977 1.0108 0.9970 1.0037 1.0069 1.0049 1.0082 1.0045 1.0033 0.9911 0.9908 0.9900
dispcorr: -0.023849798 hartree
energy: -1079.775453158037
dipole: 18.69726 -19.31328 -0.61602 22.63564 -21.10065 1.53499 -5.05909 4.87692 -0.18216
magnitude: 1.66399 au
magnitude: 4.22953 debye
