program: Orca
programVersion: 5.0.2
elementType: O O O C C C C C C C C C C C C C C C C C C C C C C H H H H H H H H H H H H H H H H H H H H H H H H H H
charge: 0
multiplicity: 1
keywords: wb97x-d3
keywords: def2-TZVPP
keywords: def2/J RIJCOSX
keywords: DEFGRID2
keywords: scfconv7
keywords: smallprint printgap noloewdin
keywords: NOSOSCF
formula: C22H26O3
InChI: InChI=1/C22H26O3/c1-15(2)10-19-20(22(19,3)4)21(23)25-14-17-12-18(24-13-17)11-16-8-6-5-7-9-16/h5-10,12-13,19-20H,11,14H2,1-4H3
51 atoms
O  1.751525 -2.135638 -1.08197
O  2.506262 -1.877167 1.006212
O  -1.861756 -2.006806 1.339027
C  4.153278 0.527813 -0.141611
C  2.822875 1.019926 0.304976
C  2.905114 -0.180727 -0.636002
C  4.895362 1.307828 -1.201302
C  5.072601 -0.126912 0.860162
C  2.196747 2.278448 -0.165926
C  2.404986 -1.468325 -0.127909
C  0.875314 2.419525 -0.304172
C  0.260053 3.711486 -0.742366
C  -0.072872 1.285163 -0.025339
C  0.933783 -3.245307 -0.673951
C  -0.346613 -2.750687 -0.099058
C  -1.50863 -2.321503 -0.820233
C  -0.625402 -2.52645 1.207065
C  -2.398329 -1.883692 0.101551
C  -3.758245 -1.289567 -0.00053
C  -3.736359 0.21589 0.129287
C  -3.817518 1.020866 -1.003215
C  -3.598537 0.824668 1.374703
C  -3.76058 2.40426 -0.897446
C  -3.535017 2.206759 1.483041
C  -3.615433 3.001897 0.346931
H  2.560008 0.734707 1.321911
H  2.645485 0.020941 -1.668979
H  5.606941 0.665032 -1.723094
H  5.461355 2.126163 -0.75087
H  4.230431 1.738109 -1.950887
H  4.541782 -0.591661 1.687361
H  5.74487 0.622746 1.282905
H  5.692261 -0.890121 0.385088
H  2.847733 3.122671 -0.375005
H  1.007233 4.481806 -0.934606
H  -0.329702 3.575069 -1.652867
H  -0.431132 4.092514 0.014687
H  -0.055237 0.986478 1.025759
H  -1.099206 1.553989 -0.271245
H  0.177487 0.396685 -0.608686
H  1.469328 -3.890504 0.02291
H  0.757904 -3.811735 -1.587064
H  -1.656169 -2.343778 -1.889106
H  -0.069573 -2.694241 2.116173
H  -4.408953 -1.723492 0.763513
H  -4.177417 -1.570278 -0.967438
H  -3.92638 0.561671 -1.979062
H  -3.542902 0.216128 2.269731
H  -3.828486 3.014876 -1.78901
H  -3.425397 2.66445 2.458168
H  -3.568517 4.080131 0.432035
elementType: O C H
totalener: -1079.75070835 hartree
nucrepener: 2219.34193201 hartree
electener: -3299.09264035 hartree
oneelecener: -5878.13748034 hartree
twoeener: 2579.04483999 hartree
cpcmener: -0.02280901 hartree
kineticenergy: 1074.85934795 hartree
xcener: -106.462884338235 hartree
chargesum: -0.0000000
charge: -0.289653 -0.475232 -0.276750 0.169992 0.006254 -0.109798 -0.289429 -0.281174 -0.336402 0.367588 0.051055 -0.244838 -0.239189 0.087841 -0.073762 -0.347501 -0.011742 0.223322 -0.068049 0.049051 -0.177793 -0.211458 -0.133739 -0.130957 -0.197003 0.100933 0.094864 0.097607 0.099281 0.091713 0.092569 0.092427 0.098140 0.120396 0.094142 0.099446 0.099225 0.108527 0.031249 0.098249 0.117294 0.117930 0.155981 0.167481 0.117171 0.104619 0.136572 0.136796 0.153651 0.155859 0.157243
qa: -0.2897 -0.4752 -0.2768 0.1700 0.0063 -0.1098 -0.2894 -0.2812 -0.3364 0.3676 0.0511 -0.2448 -0.2392 0.0878 -0.0738 -0.3475 -0.0117 0.2233 -0.0680 0.0491 -0.1778 -0.2115 -0.1337 -0.1310 -0.1970 0.1009 0.0949 0.0976 0.0993 0.0917 0.0926 0.0924 0.0981 0.1204 0.0941 0.0994 0.0992 0.1085 0.0312 0.0982 0.1173 0.1179 0.1560 0.1675 0.1172 0.1046 0.1366 0.1368 0.1537 0.1559 0.1572
va: 2.0988 2.0235 2.2718 3.7106 3.7992 3.8026 3.9088 3.8801 3.9025 4.1822 3.6748 3.9110 3.9626 3.8237 3.6260 3.9751 3.9309 3.5692 3.8152 3.5876 3.8922 3.9398 3.8374 3.8569 3.8681 1.0280 1.0322 1.0031 0.9995 1.0020 1.0212 1.0009 0.9995 1.0046 1.0109 0.9945 0.9946 0.9971 1.0384 1.0124 1.0133 0.9935 1.0095 1.0065 1.0070 1.0121 1.0044 1.0141 0.9929 0.9905 0.9922
dispcorr: -0.028753074 hartree
energy: -1079.779461419412
dipole: 11.53467 -12.16175 -0.62707 16.11867 -15.73160 0.38708 -4.32597 3.27240 -1.05357
magnitude: 1.28572 au
magnitude: 3.26803 debye
