program: Orca
programVersion: 5.0.2
elementType: O O O C C C C C C C C C C C C C C C C C C C C C C H H H H H H H H H H H H H H H H H H H H H H H H H H
charge: 0
multiplicity: 1
keywords: wb97x-d3
keywords: def2-TZVPP
keywords: def2/J RIJCOSX
keywords: DEFGRID2
keywords: scfconv7
keywords: smallprint printgap noloewdin
keywords: NOSOSCF
formula: C22H26O3
InChI: InChI=1/C22H26O3/c1-15(2)10-19-20(22(19,3)4)21(23)25-14-17-12-18(24-13-17)11-16-8-6-5-7-9-16/h5-10,12-13,19-20H,11,14H2,1-4H3
51 atoms
O  1.205775 -0.468945 0.180626
O  2.898493 0.137831 1.502586
O  -2.734856 -1.41604 -0.487238
C  4.517914 -0.423417 -1.155098
C  4.385548 1.05554 -0.942039
C  3.150056 0.179808 -0.882536
C  4.732697 -0.964556 -2.548471
C  5.219332 -1.237977 -0.096026
C  4.508627 2.028403 -2.044759
C  2.447132 -0.037854 0.395175
C  5.207862 3.167965 -2.040444
C  5.222245 4.055057 -3.249764
C  6.027134 3.670238 -0.89138
C  0.392049 -0.766324 1.312799
C  -0.954675 -1.138973 0.805981
C  -2.001042 -1.745164 1.570989
C  -1.459844 -0.964621 -0.436982
C  -3.057431 -1.888424 0.735403
C  -4.44517 -2.382891 0.939981
C  -5.410244 -1.2471 1.189337
C  -5.875998 -0.461097 0.137748
C  -5.817083 -0.941674 2.484446
C  -6.724236 0.61049 0.378921
C  -6.669171 0.127218 2.728056
C  -7.12288 0.909537 1.675271
H  4.73619 1.391137 0.028175
H  2.496102 0.219469 -1.747211
H  4.449731 -2.018108 -2.595308
H  5.78581 -0.893522 -2.829071
H  4.152201 -0.438546 -3.305253
H  4.808337 -2.248478 -0.040624
H  5.161601 -0.796911 0.896615
H  6.277628 -1.330202 -0.348913
H  3.961811 1.784759 -2.951333
H  4.60064 3.664573 -4.055706
H  4.864769 5.059233 -3.00622
H  6.237586 4.175785 -3.63748
H  7.068461 3.804815 -1.194655
H  5.676171 4.652561 -0.566141
H  6.022487 3.014087 -0.023968
H  0.328353 0.100485 1.976752
H  0.828642 -1.587024 1.888825
H  -1.965852 -2.03153 2.610802
H  -1.056832 -0.563847 -1.353174
H  -4.44361 -3.060349 1.794731
H  -4.762919 -2.967373 0.07254
H  -5.576955 -0.686806 -0.879196
H  -5.464586 -1.546229 3.312205
H  -7.076837 1.212751 -0.448886
H  -6.977909 0.347706 3.742178
H  -7.785895 1.744439 1.862693
elementType: O C H
totalener: -1079.75429910 hartree
nucrepener: 1988.75380410 hartree
electener: -3068.50810321 hartree
oneelecener: -5416.36716515 hartree
twoeener: 2347.85906195 hartree
cpcmener: -0.02573246 hartree
kineticenergy: 1074.85388071 hartree
xcener: -106.460954968250 hartree
chargesum: -0.0000000
charge: -0.275719 -0.474005 -0.279540 0.095796 0.049032 -0.083295 -0.267152 -0.275056 -0.274456 0.389012 -0.051190 -0.218788 -0.250781 0.108029 -0.024329 -0.352807 -0.070143 0.217526 -0.073366 0.049737 -0.199113 -0.195529 -0.154604 -0.147549 -0.175941 0.088720 0.088824 0.096907 0.097153 0.087522 0.098148 0.092283 0.095816 0.115659 0.087574 0.092358 0.093098 0.094993 0.095321 0.090396 0.108467 0.110207 0.161039 0.171100 0.104213 0.116236 0.138246 0.139378 0.156861 0.156166 0.157545
qa: -0.2757 -0.4740 -0.2795 0.0958 0.0490 -0.0833 -0.2672 -0.2751 -0.2745 0.3890 -0.0512 -0.2188 -0.2508 0.1080 -0.0243 -0.3528 -0.0701 0.2175 -0.0734 0.0497 -0.1991 -0.1955 -0.1546 -0.1475 -0.1759 0.0887 0.0888 0.0969 0.0972 0.0875 0.0981 0.0923 0.0958 0.1157 0.0876 0.0924 0.0931 0.0950 0.0953 0.0904 0.1085 0.1102 0.1610 0.1711 0.1042 0.1162 0.1382 0.1394 0.1569 0.1562 0.1575
va: 2.1356 2.0363 2.2690 3.7006 3.7619 3.8455 3.9103 3.9044 3.8763 4.1676 3.7653 3.9210 3.9412 3.8474 3.7135 4.0129 3.9515 3.6308 3.8238 3.6050 3.9587 3.9421 3.9018 3.8904 3.9058 1.0334 1.0319 1.0021 1.0018 1.0066 0.9994 1.0194 1.0002 1.0114 1.0091 0.9964 0.9961 0.9972 0.9968 1.0100 0.9934 0.9925 1.0066 1.0008 1.0111 1.0089 1.0132 1.0040 0.9910 0.9910 0.9905
dispcorr: -0.020941208 hartree
energy: -1079.775240312300
dipole: 29.66200 -29.76796 -0.10596 10.12307 -10.38828 -0.26521 -10.76586 10.21292 -0.55294
magnitude: 0.62234 au
magnitude: 1.58186 debye
