program: Orca
programVersion: 5.0.2
elementType: O O O C C C C C C C C C C C C C C C C C C C C C C H H H H H H H H H H H H H H H H H H H H H H H H H H
charge: 0
multiplicity: 1
keywords: wb97x-d3
keywords: def2-TZVPP
keywords: def2/J RIJCOSX
keywords: DEFGRID2
keywords: scfconv7
keywords: smallprint printgap noloewdin
keywords: NOSOSCF
formula: C22H26O3
InChI: InChI=1/C22H26O3/c1-15(2)10-19-20(22(19,3)4)21(23)25-14-17-12-18(24-13-17)11-16-8-6-5-7-9-16/h5-10,12-13,19-20H,11,14H2,1-4H3
51 atoms
O  0.794537 0.091258 -0.837436
O  1.810346 1.550701 -2.185865
O  -3.228663 -1.644854 -0.180633
C  4.020884 1.375992 0.054174
C  4.445526 0.582572 -1.145419
C  3.074471 0.348051 -0.543374
C  4.586849 1.037549 1.412285
C  3.760303 2.851937 -0.119772
C  5.452405 -0.494557 -1.069851
C  1.863503 0.743448 -1.286974
C  6.508208 -0.657845 -1.874026
C  7.445813 -1.81225 -1.68111
C  6.866324 0.248894 -3.011789
C  -0.474291 0.406003 -1.429137
C  -1.513767 -0.326683 -0.667015
C  -1.809252 -0.212679 0.730333
C  -2.40713 -1.21368 -1.160027
C  -2.857347 -1.034643 0.969536
C  -3.657879 -1.324404 2.187894
C  -5.013063 -0.658868 2.136538
C  -5.201368 0.599104 2.702005
C  -6.082545 -1.269001 1.486912
C  -6.432316 1.235501 2.621002
C  -7.313567 -0.633198 1.400798
C  -7.492158 0.621722 1.967421
H  4.428446 1.147082 -2.071705
H  2.959676 -0.554727 0.046919
H  5.571119 1.492793 1.541904
H  4.694494 -0.034103 1.575314
H  3.938588 1.424177 2.201334
H  2.982303 3.198463 0.564089
H  3.463101 3.120425 -1.130913
H  4.669271 3.411794 0.1103
H  5.308952 -1.224583 -0.278159
H  7.500885 -2.429097 -2.582409
H  8.463699 -1.464358 -1.484512
H  7.146024 -2.455445 -0.853468
H  6.849021 -0.295678 -3.959762
H  6.209605 1.11057 -3.113371
H  7.885767 0.625698 -2.894347
H  -0.486617 0.113057 -2.481503
H  -0.644866 1.483906 -1.37714
H  -1.3070 0.407278 1.45677
H  -2.57051 -1.615586 -2.148209
H  -3.097615 -0.963921 3.051464
H  -3.772412 -2.404684 2.312215
H  -4.377769 1.085046 3.212539
H  -5.955799 -2.251464 1.047313
H  -6.563634 2.211649 3.070842
H  -8.135659 -1.120091 0.891522
H  -8.45239 1.117384 1.902633
elementType: O C H
totalener: -1079.75594969 hartree
nucrepener: 1990.42217658 hartree
electener: -3070.17812628 hartree
oneelecener: -5419.75078007 hartree
twoeener: 2349.57265379 hartree
cpcmener: -0.02649996 hartree
kineticenergy: 1074.85951007 hartree
xcener: -106.459776333298 hartree
chargesum: 0.0000000
charge: -0.276337 -0.477611 -0.279667 0.100709 0.046074 -0.090686 -0.266377 -0.277530 -0.273205 0.400560 -0.046986 -0.218795 -0.252528 0.090209 -0.077902 -0.321910 -0.033873 0.199735 -0.069806 0.065799 -0.204449 -0.200127 -0.147292 -0.153548 -0.175360 0.088948 0.087374 0.096750 0.087024 0.097140 0.098350 0.092442 0.095374 0.115422 0.092407 0.092761 0.087756 0.096334 0.090563 0.094262 0.109828 0.111542 0.161921 0.174338 0.107389 0.116406 0.138864 0.138772 0.156685 0.155228 0.157019
qa: -0.2763 -0.4776 -0.2797 0.1007 0.0461 -0.0907 -0.2664 -0.2775 -0.2732 0.4006 -0.0470 -0.2188 -0.2525 0.0902 -0.0779 -0.3219 -0.0339 0.1997 -0.0698 0.0658 -0.2044 -0.2001 -0.1473 -0.1535 -0.1754 0.0889 0.0874 0.0968 0.0870 0.0971 0.0984 0.0924 0.0954 0.1154 0.0924 0.0928 0.0878 0.0963 0.0906 0.0943 0.1098 0.1115 0.1619 0.1743 0.1074 0.1164 0.1389 0.1388 0.1567 0.1552 0.1570
va: 2.1248 2.0315 2.2768 3.6963 3.7615 3.8666 3.9108 3.9025 3.8762 4.1517 3.7607 3.9226 3.9421 3.8448 3.7417 4.0069 3.9504 3.6408 3.8289 3.5748 3.9497 3.9594 3.8892 3.8997 3.9048 1.0347 1.0360 1.0022 1.0063 1.0020 0.9991 1.0197 1.0005 1.0116 0.9959 0.9965 1.0090 0.9967 1.0097 0.9975 1.0007 0.9939 1.0090 0.9949 1.0105 1.0065 1.0044 1.0104 0.9907 0.9914 0.9906
dispcorr: -0.020915091 hartree
energy: -1079.776864784627
dipole: 34.41142 -34.11901 0.29241 4.08948 -4.48223 -0.39275 -0.74123 1.64933 0.90811
magnitude: 1.03170 au
magnitude: 2.62238 debye
