program: Orca
programVersion: 5.0.2
elementType: O O O C C C C C C C C C C C C C C C C C C C C C C H H H H H H H H H H H H H H H H H H H H H H H H H H
charge: 0
multiplicity: 1
keywords: wb97x-d3
keywords: def2-TZVPP
keywords: def2/J RIJCOSX
keywords: DEFGRID2
keywords: scfconv7
keywords: smallprint printgap noloewdin
keywords: NOSOSCF
formula: C22H26O3
InChI: InChI=1/C22H26O3/c1-15(2)10-19-20(22(19,3)4)21(23)25-14-17-12-18(24-13-17)11-16-8-6-5-7-9-16/h5-10,12-13,19-20H,11,14H2,1-4H3
51 atoms
O  0.99399 -1.069865 0.12535
O  3.09122 -1.830896 0.06191
O  -2.974554 -2.088408 1.631125
C  3.465386 0.722714 -1.773811
C  4.021669 0.973093 -0.403843
C  2.611421 0.438021 -0.550266
C  3.028364 1.896236 -2.616883
C  4.047649 -0.40581 -2.587442
C  4.234893 2.328812 0.141504
C  2.297441 -0.932845 -0.1014
C  5.391311 2.768736 0.64548
C  5.52033 4.154386 1.199503
C  6.629588 1.913076 0.706504
C  0.530361 -2.335671 0.624843
C  -0.944336 -2.243856 0.752193
C  -1.910279 -2.204987 -0.305054
C  -1.655957 -2.167123 1.900155
C  -3.124521 -2.110211 0.285178
C  -4.503507 -1.981248 -0.250895
C  -5.05789 -0.587951 -0.062214
C  -6.103245 -0.343003 0.820574
C  -4.510405 0.481464 -0.768064
C  -6.598101 0.944703 0.992369
C  -5.001177 1.766794 -0.59895
C  -6.048284 2.002869 0.284163
H  4.743251 0.228216 -0.082817
H  1.810757 1.151404 -0.386984
H  2.54125 2.677936 -2.034959
H  2.324161 1.573469 -3.386344
H  3.8862 2.345306 -3.122174
H  3.305411 -0.824379 -3.270649
H  4.438134 -1.217578 -1.977687
H  4.874046 -0.028997 -3.193975
H  3.383759 3.003357 0.131739
H  6.290456 4.720321 0.668161
H  4.586859 4.713811 1.13468
H  5.826663 4.130979 2.249121
H  6.52405 1.095985 1.424537
H  6.86847 1.461298 -0.257561
H  7.49807 2.495375 1.014736
H  0.990693 -2.545796 1.592833
H  0.814684 -3.132618 -0.065535
H  -1.717907 -2.24333 -1.366154
H  -1.367617 -2.168469 2.9402
H  -5.163626 -2.711312 0.224672
H  -4.473509 -2.231184 -1.313158
H  -6.538057 -1.164503 1.377913
H  -3.691904 0.305485 -1.457001
H  -7.413848 1.119183 1.682551
H  -4.567354 2.586224 -1.158154
H  -6.43264 3.006164 0.416733
elementType: O C H
totalener: -1079.75471384 hartree
nucrepener: 2016.56582989 hartree
electener: -3096.32054373 hartree
oneelecener: -5472.10206835 hartree
twoeener: 2375.78152462 hartree
cpcmener: -0.02651798 hartree
kineticenergy: 1074.85295844 hartree
xcener: -106.457164392709 hartree
chargesum: -0.0000000
charge: -0.273439 -0.479354 -0.277209 0.111812 0.049695 -0.115279 -0.264623 -0.279816 -0.299858 0.404090 -0.011134 -0.221279 -0.283585 0.085573 -0.084539 -0.316386 -0.028320 0.199519 -0.063159 0.029114 -0.186144 -0.187189 -0.153985 -0.160329 -0.170575 0.090620 0.087076 0.087730 0.096896 0.096375 0.097519 0.092179 0.095243 0.117461 0.094912 0.084650 0.097881 0.104139 0.102967 0.094869 0.110680 0.111056 0.161789 0.175113 0.107134 0.117393 0.139113 0.142832 0.156028 0.156970 0.157773
qa: -0.2734 -0.4794 -0.2772 0.1118 0.0497 -0.1153 -0.2646 -0.2798 -0.2999 0.4041 -0.0111 -0.2213 -0.2836 0.0856 -0.0845 -0.3164 -0.0283 0.1995 -0.0632 0.0291 -0.1861 -0.1872 -0.1540 -0.1603 -0.1706 0.0906 0.0871 0.0877 0.0969 0.0964 0.0975 0.0922 0.0952 0.1175 0.0949 0.0847 0.0979 0.1041 0.1030 0.0949 0.1107 0.1111 0.1618 0.1751 0.1071 0.1174 0.1391 0.1428 0.1560 0.1570 0.1578
va: 2.1238 2.0274 2.2772 3.6964 3.7401 3.9098 3.9110 3.9046 3.8889 4.1488 3.6960 3.9216 3.9406 3.8432 3.7403 3.9926 3.9501 3.6288 3.8237 3.6182 3.9485 3.9367 3.8952 3.9127 3.9009 1.0301 1.0367 1.0053 1.0026 1.0023 0.9999 1.0199 1.0005 1.0096 0.9936 1.0102 0.9926 0.9963 0.9958 1.0048 1.0004 0.9942 1.0077 0.9953 1.0104 1.0059 1.0042 1.0035 0.9912 0.9915 0.9904
dispcorr: -0.021100192 hartree
energy: -1079.775814028882
dipole: 27.31531 -27.77958 -0.46427 17.16246 -16.55412 0.60834 -7.73801 7.30052 -0.43750
magnitude: 0.88149 au
magnitude: 2.24058 debye
