program: Orca
programVersion: 5.0.2
elementType: O O O C C C C C C C C C C C C C C C C C C C C C C H H H H H H H H H H H H H H H H H H H H H H H H H H
charge: 0
multiplicity: 1
keywords: wb97x-d3
keywords: def2-TZVPP
keywords: def2/J RIJCOSX
keywords: DEFGRID2
keywords: scfconv7
keywords: smallprint printgap noloewdin
keywords: NOSOSCF
formula: C22H26O3
InChI: InChI=1/C22H26O3/c1-15(2)10-19-20(22(19,3)4)21(23)25-14-17-12-18(24-13-17)11-16-8-6-5-7-9-16/h5-10,12-13,19-20H,11,14H2,1-4H3
51 atoms
O  1.04573 -1.090674 0.006488
O  3.176477 -1.747827 0.106514
O  -3.023683 -2.668168 0.133322
C  3.530855 0.770173 -1.77634
C  4.012262 1.08011 -0.390575
C  2.631659 0.482533 -0.58641
C  3.082702 1.891504 -2.6827
C  4.190741 -0.359946 -2.527794
C  4.129697 2.45603 0.130008
C  2.353834 -0.892068 -0.126161
C  5.139928 2.94809 0.855078
C  5.114316 4.365962 1.341821
C  6.351783 2.168529 1.270176
C  0.604389 -2.382074 0.457266
C  -0.874281 -2.327019 0.556537
C  -1.659894 -1.582217 1.495465
C  -1.762545 -2.961359 -0.242076
C  -2.955959 -1.826316 1.191822
C  -4.240785 -1.322412 1.742785
C  -4.920363 -0.371885 0.785247
C  -4.546313 0.968888 0.746393
C  -5.893783 -0.822717 -0.100612
C  -5.134807 1.842676 -0.155965
C  -6.483696 0.049458 -1.006742
C  -6.105663 1.384305 -1.037529
H  4.742086 0.37205 -0.012958
H  1.794648 1.164222 -0.48016
H  2.523388 2.666798 -2.160524
H  2.439478 1.504679 -3.475623
H  3.943296 2.366041 -3.159122
H  4.611403 -1.123316 -1.876774
H  5.0080 0.033616 -3.135848
H  3.485164 -0.846172 -3.205177
H  3.301627 3.122381 -0.093636
H  5.210782 4.40961 2.430304
H  5.954599 4.936195 0.936294
H  4.194266 4.881807 1.066358
H  7.258362 2.759528 1.121612
H  6.312065 1.930414 2.336885
H  6.480039 1.233037 0.729049
H  1.055675 -2.605918 1.426495
H  0.916382 -3.155269 -0.248124
H  -1.299325 -0.947525 2.290181
H  -1.64398 -3.632306 -1.079098
H  -4.02623 -0.817317 2.685688
H  -4.905162 -2.15897 1.975296
H  -3.787436 1.333207 1.429548
H  -6.198136 -1.862703 -0.080883
H  -4.836233 2.883344 -0.169791
H  -7.240842 -0.315843 -1.68911
H  -6.566092 2.064928 -1.742382
elementType: O C H
totalener: -1079.75605495 hartree
nucrepener: 2017.78287288 hartree
electener: -3097.53892784 hartree
oneelecener: -5474.57359186 hartree
twoeener: 2377.03466402 hartree
cpcmener: -0.02683233 hartree
kineticenergy: 1074.85435300 hartree
xcener: -106.458222118031 hartree
chargesum: -0.0000000
charge: -0.272632 -0.478968 -0.277947 0.096785 0.048184 -0.085557 -0.268292 -0.276569 -0.280156 0.396759 -0.037905 -0.219421 -0.262131 0.085184 -0.083050 -0.320144 -0.026712 0.193300 -0.065049 0.059526 -0.201427 -0.193884 -0.153617 -0.154747 -0.174121 0.086585 0.087563 0.087455 0.097294 0.096766 0.092506 0.095839 0.098286 0.115442 0.092290 0.093841 0.087676 0.092066 0.101610 0.093148 0.112582 0.109986 0.161254 0.174289 0.112374 0.112544 0.141113 0.139456 0.156674 0.156089 0.157860
qa: -0.2726 -0.4790 -0.2779 0.0968 0.0482 -0.0856 -0.2683 -0.2766 -0.2802 0.3968 -0.0379 -0.2194 -0.2621 0.0852 -0.0831 -0.3201 -0.0267 0.1933 -0.0650 0.0595 -0.2014 -0.1939 -0.1536 -0.1547 -0.1741 0.0866 0.0876 0.0875 0.0973 0.0968 0.0925 0.0958 0.0983 0.1154 0.0923 0.0938 0.0877 0.0921 0.1016 0.0931 0.1126 0.1100 0.1613 0.1743 0.1124 0.1125 0.1411 0.1395 0.1567 0.1561 0.1579
va: 2.1225 2.0295 2.2788 3.7063 3.7558 3.8572 3.9105 3.9044 3.8923 4.1589 3.7479 3.9233 3.9424 3.8448 3.7400 4.0014 3.9484 3.6423 3.8258 3.5738 3.9473 3.9582 3.9002 3.8983 3.9022 1.0362 1.0344 1.0067 1.0018 1.0017 1.0192 1.0002 0.9994 1.0120 0.9953 0.9962 1.0092 0.9984 0.9949 1.0075 0.9929 1.0015 1.0079 0.9950 1.0087 1.0071 1.0036 1.0066 0.9909 0.9910 0.9904
dispcorr: -0.020927362 hartree
energy: -1079.776982316027
dipole: 26.47389 -26.95317 -0.47928 18.93570 -18.16035 0.77535 -3.84726 3.91404 0.06679
magnitude: 0.91397 au
magnitude: 2.32312 debye
