program: Orca
programVersion: 5.0.2
elementType: O O O C C C C C C C C C C C C C C C C C C C C C C H H H H H H H H H H H H H H H H H H H H H H H H H H
charge: 0
multiplicity: 1
keywords: wb97x-d3
keywords: def2-TZVPP
keywords: def2/J RIJCOSX
keywords: DEFGRID2
keywords: scfconv7
keywords: smallprint printgap noloewdin
keywords: NOSOSCF
formula: C22H26O3
InChI: InChI=1/C22H26O3/c1-15(2)10-19-20(22(19,3)4)21(23)25-14-17-12-18(24-13-17)11-16-8-6-5-7-9-16/h5-10,12-13,19-20H,11,14H2,1-4H3
51 atoms
O  1.793005 -2.127143 -0.985218
O  2.41859 -1.853485 1.144736
O  -1.956043 -2.082202 1.264836
C  4.127708 0.554168 0.079356
C  2.771772 1.04344 0.439544
C  2.913779 -0.166528 -0.480958
C  4.925386 1.32149 -0.948427
C  4.989987 -0.077484 1.144426
C  2.16203 2.288915 -0.085804
C  2.387066 -1.450527 0.00216
C  0.860546 2.382163 -0.372125
C  0.244746 3.650076 -0.873788
C  -0.061943 1.203314 -0.227181
C  0.960254 -3.244023 -0.623294
C  -0.348801 -2.760427 -0.107883
C  -1.454073 -2.276978 -0.882253
C  -0.714538 -2.610197 1.186805
C  -2.402268 -1.879333 -0.002631
C  -3.742789 -1.257268 -0.170636
C  -3.700404 0.245021 -0.012387
C  -3.574875 0.828397 1.246757
C  -3.750704 1.071777 -1.13095
C  -3.491492 2.207073 1.381961
C  -3.672177 2.452259 -0.998502
C  -3.538906 3.024415 0.259311
H  2.452634 0.770635 1.443939
H  2.719375 0.025499 -1.529708
H  4.2993 1.738349 -1.737595
H  5.664996 0.672617 -1.420584
H  5.463386 2.146839 -0.478019
H  5.632991 -0.852343 0.723257
H  4.41554 -0.517636 1.955943
H  5.639477 0.683641 1.581194
H  2.803921 3.156122 -0.212033
H  -0.255462 3.488316 -1.832134
H  -0.524924 4.008346 -0.184791
H  0.980401 4.443866 -1.002596
H  -1.103898 1.499149 -0.336104
H  0.139018 0.451201 -0.994302
H  0.044855 0.705385 0.738654
H  1.464483 -3.891572 0.093782
H  0.832169 -3.803267 -1.548128
H  -1.526394 -2.237429 -1.95807
H  -0.224714 -2.839829 2.120014
H  -4.444449 -1.691462 0.546231
H  -4.108861 -1.510712 -1.165817
H  -3.542811 0.202551 2.130695
H  -3.852092 0.631499 -2.11597
H  -3.390834 2.645049 2.366727
H  -3.71688 3.080089 -1.879119
H  -3.476546 4.099716 0.365395
elementType: O C H
totalener: -1079.73796846 hartree
nucrepener: 2224.88510505 hartree
electener: -3304.62307350 hartree
oneelecener: -5889.41039634 hartree
twoeener: 2584.78732283 hartree
cpcmener: -0.02770396 hartree
kineticenergy: 1074.85642828 hartree
xcener: -106.464439493727 hartree
chargesum: 0.0000000
charge: -0.296401 -0.504031 -0.285267 0.172576 0.008531 -0.103724 -0.287361 -0.284265 -0.349244 0.383117 0.053576 -0.250464 -0.229586 0.093126 -0.056839 -0.381052 -0.022130 0.241156 -0.059121 0.041395 -0.217039 -0.180988 -0.130487 -0.131508 -0.204804 0.102458 0.094340 0.092398 0.098521 0.099520 0.100185 0.090136 0.094199 0.123165 0.103611 0.098996 0.096739 0.016380 0.110129 0.104921 0.118978 0.121549 0.160342 0.172629 0.117516 0.105490 0.139801 0.140426 0.159907 0.157237 0.161266
qa: -0.2964 -0.5040 -0.2853 0.1726 0.0085 -0.1037 -0.2874 -0.2843 -0.3492 0.3831 0.0536 -0.2505 -0.2296 0.0931 -0.0568 -0.3811 -0.0221 0.2412 -0.0591 0.0414 -0.2170 -0.1810 -0.1305 -0.1315 -0.2048 0.1025 0.0943 0.0924 0.0985 0.0995 0.1002 0.0901 0.0942 0.1232 0.1036 0.0990 0.0967 0.0164 0.1101 0.1049 0.1190 0.1215 0.1603 0.1726 0.1175 0.1055 0.1398 0.1404 0.1599 0.1572 0.1613
va: 2.0972 1.9903 2.2612 3.7045 3.7923 3.8091 3.9096 3.8832 3.9154 4.1568 3.6715 3.9105 3.9597 3.8133 3.6055 3.9601 3.9355 3.5459 3.8058 3.5884 3.9356 3.8801 3.8508 3.8170 3.8595 1.0260 1.0333 1.0019 1.0027 0.9998 0.9990 1.0200 1.0007 1.0045 0.9940 0.9947 1.0100 1.0382 1.0039 0.9994 1.0122 0.9933 1.0094 1.0031 1.0073 1.0123 1.0139 1.0033 0.9893 0.9921 0.9911
dispcorr: -0.029132971 hartree
energy: -1079.767101427841
dipole: 11.70950 -12.27036 -0.56086 16.03610 -15.60962 0.42648 -4.35044 3.09935 -1.25109
magnitude: 1.43586 au
magnitude: 3.64966 debye
