program: Orca
programVersion: 5.0.2
elementType: O O O C C C C C C C C C C C C C C C C C C C C C C H H H H H H H H H H H H H H H H H H H H H H H H H H
charge: 0
multiplicity: 1
keywords: wb97x-d3
keywords: def2-TZVPP
keywords: def2/J RIJCOSX
keywords: DEFGRID2
keywords: scfconv7
keywords: smallprint printgap noloewdin
keywords: NOSOSCF
formula: C22H26O3
InChI: InChI=1/C22H26O3/c1-15(2)10-19-20(22(19,3)4)21(23)25-14-17-12-18(24-13-17)11-16-8-6-5-7-9-16/h5-10,12-13,19-20H,11,14H2,1-4H3
51 atoms
O  1.57591 -1.961188 -0.373088
O  0.816599 -0.708562 -2.064977
O  -2.305224 -2.82923 1.32289
C  1.560148 1.52383 0.071173
C  2.450326 1.573784 -1.123864
C  2.252043 0.253617 -0.413595
C  2.063311 2.067265 1.385893
C  0.070388 1.695117 -0.10213
C  3.779771 2.238142 -1.104166
C  1.477669 -0.821314 -1.055637
C  4.81891 1.872748 -1.859674
C  6.122292 2.608673 -1.810708
C  4.777421 0.714772 -2.807873
C  0.70783 -3.05321 -0.733461
C  -0.645577 -2.842564 -0.153245
C  -1.732214 -2.067111 -0.676714
C  -1.057858 -3.278805 1.059968
C  -2.708325 -2.086669 0.259944
C  -4.009141 -1.375222 0.370663
C  -3.825621 -0.04503 1.064037
C  -3.711031 0.025151 2.450435
C  -3.707988 1.125941 0.32098
C  -3.480171 1.240374 3.079867
C  -3.481005 2.343871 0.948641
C  -3.362037 2.404029 2.330451
H  1.921991 1.63742 -2.072132
H  3.061401 -0.087526 0.222342
H  1.901781 3.145796 1.441076
H  3.126114 1.88138 1.538379
H  1.524032 1.611034 2.217708
H  -0.195252 2.745101 0.036073
H  -0.478945 1.117797 0.644585
H  -0.288305 1.400437 -1.086388
H  3.894244 3.094778 -0.445943
H  6.38329 3.00919 -2.793531
H  6.101285 3.43705 -1.102934
H  6.937849 1.939513 -1.524937
H  5.544782 -0.020129 -2.551119
H  3.816632 0.203221 -2.824222
H  4.99851 1.044471 -3.826192
H  1.17925 -3.934297 -0.302368
H  0.676938 -3.182125 -1.815241
H  -1.780626 -1.556461 -1.624606
H  -0.594014 -3.896751 1.81308
H  -4.731985 -1.991726 0.909683
H  -4.405257 -1.218261 -0.633014
H  -3.805278 -0.876136 3.044546
H  -3.794967 1.085503 -0.758427
H  -3.39417 1.2788 4.158172
H  -3.395847 3.245852 0.356344
H  -3.182749 3.351782 2.821207
elementType: O C H
totalener: -1079.73841898 hartree
nucrepener: 2166.55284486 hartree
electener: -3246.29126383 hartree
oneelecener: -5772.85533680 hartree
twoeener: 2526.56407296 hartree
cpcmener: -0.02840430 hartree
kineticenergy: 1074.85907883 hartree
xcener: -106.461307031295 hartree
chargesum: -0.0000000
charge: -0.288822 -0.501913 -0.282620 0.193414 -0.031125 -0.113316 -0.294892 -0.299999 -0.295446 0.421605 -0.017044 -0.229364 -0.240769 0.075604 -0.064686 -0.357522 -0.039945 0.235727 -0.042314 0.053836 -0.201923 -0.217658 -0.155115 -0.169402 -0.165854 0.103636 0.095566 0.100597 0.094768 0.097750 0.102679 0.088520 0.094848 0.125400 0.095921 0.090078 0.095228 0.097484 0.077719 0.100751 0.120287 0.119925 0.160714 0.179694 0.114290 0.107106 0.142405 0.142213 0.160189 0.160293 0.161486
qa: -0.2888 -0.5019 -0.2826 0.1934 -0.0311 -0.1133 -0.2949 -0.3000 -0.2954 0.4216 -0.0170 -0.2294 -0.2408 0.0756 -0.0647 -0.3575 -0.0399 0.2357 -0.0423 0.0538 -0.2019 -0.2177 -0.1551 -0.1694 -0.1659 0.1036 0.0956 0.1006 0.0948 0.0977 0.1027 0.0885 0.0948 0.1254 0.0959 0.0901 0.0952 0.0975 0.0777 0.1008 0.1203 0.1199 0.1607 0.1797 0.1143 0.1071 0.1424 0.1422 0.1602 0.1603 0.1615
va: 2.1172 1.9906 2.2682 3.6892 3.8352 3.8224 3.9043 3.8797 3.8840 4.1217 3.7098 3.9289 3.9366 3.8415 3.6538 3.9560 3.9662 3.5961 3.8031 3.5835 3.9478 3.8946 3.8977 3.8517 3.8749 1.0261 1.0313 0.9992 1.0017 1.0026 1.0016 0.9954 1.0155 1.0024 0.9958 1.0062 0.9964 0.9987 1.0183 0.9994 0.9972 1.0080 1.0190 0.9922 1.0118 1.0114 1.0109 1.0050 0.9896 0.9908 0.9886
dispcorr: -0.025967971 hartree
energy: -1079.764386949838
dipole: 19.51469 -19.07825 0.43644 16.94593 -16.98967 -0.04374 -3.62816 4.28960 0.66144
magnitude: 0.79366 au
magnitude: 2.01732 debye
