program: Orca
programVersion: 5.0.2
elementType: O O O C C C C C C C C C C C C C C C C C C C C C C H H H H H H H H H H H H H H H H H H H H H H H H H H
charge: 0
multiplicity: 1
keywords: wb97x-d3
keywords: def2-TZVPP
keywords: def2/J RIJCOSX
keywords: DEFGRID2
keywords: scfconv7
keywords: smallprint printgap noloewdin
keywords: NOSOSCF
formula: C22H26O3
InChI: InChI=1/C22H26O3/c1-15(2)10-19-20(22(19,3)4)21(23)25-14-17-12-18(24-13-17)11-16-8-6-5-7-9-16/h5-10,12-13,19-20H,11,14H2,1-4H3
51 atoms
O  1.073328 -1.030375 0.152347
O  2.932168 -0.745067 1.356024
O  -2.545715 -3.481963 0.062463
C  4.095709 -0.018306 -1.485713
C  3.892295 1.224239 -0.673308
C  2.751676 0.234887 -0.822546
C  4.112777 0.069403 -2.992731
C  5.026623 -1.080467 -0.953811
C  3.753638 2.561293 -1.283405
C  2.298336 -0.545569 0.342436
C  4.363221 3.685444 -0.892188
C  4.107363 4.980302 -1.603831
C  5.326867 3.787213 0.25075
C  0.502647 -1.823954 1.209342
C  -0.852929 -2.236498 0.773754
C  -2.026506 -1.417963 0.680326
C  -1.232102 -3.473923 0.384263
C  -3.023742 -2.222467 0.244748
C  -4.460734 -1.995375 -0.06849
C  -4.937119 -0.669922 0.458519
C  -5.067036 0.430239 -0.381825
C  -5.235508 -0.520815 1.811276
C  -5.49446 1.655642 0.115487
C  -5.662118 0.700392 2.311241
C  -5.793881 1.793671 1.463258
H  4.374707 1.196762 0.298018
H  1.959168 0.520007 -1.505661
H  3.383107 0.774928 -3.387246
H  3.89704 -0.906077 -3.432112
H  5.099479 0.37792 -3.343843
H  6.030319 -0.915407 -1.350034
H  4.708428 -2.074696 -1.273591
H  5.103984 -1.082969 0.130919
H  3.077179 2.627807 -2.130696
H  3.726993 5.737335 -0.912994
H  5.030353 5.385754 -2.026276
H  3.385787 4.871027 -2.413191
H  4.932199 4.447703 1.026882
H  5.563257 2.832125 0.715209
H  6.266012 4.234331 -0.083587
H  0.454006 -1.231398 2.124965
H  1.128078 -2.697916 1.399965
H  -2.104159 -0.368594 0.917702
H  -0.701209 -4.409545 0.300474
H  -5.056087 -2.804385 0.364121
H  -4.615302 -2.044422 -1.150515
H  -4.837119 0.328015 -1.43578
H  -5.136163 -1.370193 2.477075
H  -5.594603 2.501405 -0.552415
H  -5.89503 0.798895 3.363665
H  -6.130046 2.746053 1.852102
elementType: O C H
totalener: -1079.74240427 hartree
nucrepener: 2013.49916824 hartree
electener: -3093.24157251 hartree
oneelecener: -5466.03445004 hartree
twoeener: 2372.79287752 hartree
cpcmener: -0.03052497 hartree
kineticenergy: 1074.84422330 hartree
xcener: -106.459097731910 hartree
chargesum: 0.0000000
charge: -0.279547 -0.508184 -0.287143 0.101376 0.049580 -0.094485 -0.268831 -0.276257 -0.287735 0.422635 -0.047888 -0.219254 -0.254527 0.089064 -0.113626 -0.285370 -0.025514 0.172774 -0.003612 -0.006735 -0.180576 -0.204396 -0.159826 -0.150675 -0.170989 0.089298 0.090282 0.089389 0.098330 0.097054 0.097572 0.099711 0.090756 0.121549 0.093013 0.094135 0.089152 0.098086 0.091065 0.095158 0.114047 0.113135 0.164729 0.179392 0.110204 0.104352 0.142540 0.144821 0.160513 0.160207 0.161252
qa: -0.2795 -0.5082 -0.2871 0.1014 0.0496 -0.0945 -0.2688 -0.2763 -0.2877 0.4226 -0.0479 -0.2193 -0.2545 0.0891 -0.1136 -0.2854 -0.0255 0.1728 -0.0036 -0.0067 -0.1806 -0.2044 -0.1598 -0.1507 -0.1710 0.0893 0.0903 0.0894 0.0983 0.0971 0.0976 0.0997 0.0908 0.1215 0.0930 0.0941 0.0892 0.0981 0.0911 0.0952 0.1140 0.1131 0.1647 0.1794 0.1102 0.1044 0.1425 0.1448 0.1605 0.1602 0.1613
va: 2.1190 1.9923 2.2652 3.6960 3.7525 3.8664 3.9094 3.9027 3.8752 4.1194 3.7535 3.9200 3.9416 3.8435 3.7902 3.9531 3.9439 3.6763 3.8090 3.6278 3.9186 3.9280 3.8911 3.8829 3.8890 1.0348 1.0352 1.0059 1.0017 1.0021 1.0002 0.9991 1.0189 1.0101 0.9959 0.9961 1.0086 0.9963 1.0091 0.9973 0.9924 1.0014 1.0025 0.9939 1.0070 1.0059 1.0038 1.0018 0.9898 0.9897 0.9892
dispcorr: -0.021011012 hartree
energy: -1079.763415280245
dipole: 25.69295 -26.17320 -0.48025 18.41057 -18.05785 0.35273 -9.50380 8.68532 -0.81848
magnitude: 1.01241 au
magnitude: 2.57334 debye
