program: Orca
programVersion: 5.0.2
elementType: O O O C C C C C C C C C C C C C C C C C C C C C C H H H H H H H H H H H H H H H H H H H H H H H H H H
charge: 0
multiplicity: 1
keywords: wb97x-d3
keywords: def2-TZVPP
keywords: def2/J RIJCOSX
keywords: DEFGRID2
keywords: scfconv7
keywords: smallprint printgap noloewdin
keywords: NOSOSCF
formula: C22H26O3
InChI: InChI=1/C22H26O3/c1-15(2)10-19-20(22(19,3)4)21(23)25-14-17-12-18(24-13-17)11-16-8-6-5-7-9-16/h5-10,12-13,19-20H,11,14H2,1-4H3
51 atoms
O  0.983177 0.602902 -0.640324
O  2.264318 2.38955 -1.030663
O  -3.294159 -0.537739 -0.709677
C  4.406986 0.551714 0.404098
C  4.659913 0.597367 -1.06318
C  3.268496 0.262528 -0.567089
C  4.882605 -0.642409 1.195562
C  4.434994 1.835418 1.196063
C  5.471405 -0.437461 -1.755814
C  2.160973 1.209368 -0.772786
C  5.244658 -0.896775 -2.98935
C  6.134599 -1.928776 -3.611501
C  4.106747 -0.436831 -3.847144
C  -0.199783 1.40845 -0.761877
C  -1.360897 0.529093 -0.485569
C  -1.625106 -0.214435 0.71091
C  -2.405343 0.288014 -1.308715
C  -2.807324 -0.843854 0.520829
C  -3.640156 -1.714561 1.390834
C  -4.811277 -0.963501 1.97894
C  -5.99675 -0.815173 1.264438
C  -4.705248 -0.37134 3.234175
C  -7.052947 -0.084941 1.792842
C  -5.760646 0.356829 3.766173
C  -6.937602 0.504832 3.044825
H  4.745005 1.602061 -1.471355
H  2.978145 -0.780527 -0.621567
H  5.922052 -0.5115 1.503061
H  4.815986 -1.572569 0.631475
H  4.284333 -0.761675 2.100447
H  3.752331 1.787635 2.046588
H  4.178085 2.711313 0.604713
H  5.439703 1.995544 1.591926
H  6.329679 -0.823457 -1.212542
H  5.565184 -2.820597 -3.885398
H  6.583509 -1.554455 -4.534944
H  6.939862 -2.234479 -2.943921
H  3.490975 0.326133 -3.374191
H  4.479007 -0.028155 -4.789834
H  3.459544 -1.276805 -4.112371
H  -0.269331 1.836199 -1.764027
H  -0.15464 2.230145 -0.0437
H  -1.012481 -0.2683 1.597146
H  -2.643105 0.622258 -2.306517
H  -3.004072 -2.094335 2.190886
H  -3.993306 -2.579994 0.824534
H  -6.099171 -1.278078 0.290162
H  -3.788337 -0.482264 3.801043
H  -7.96933 0.02029 1.226628
H  -5.663813 0.807029 4.745777
H  -7.761818 1.07183 3.457692
elementType: O C H
totalener: -1079.74046263 hartree
nucrepener: 2015.56268221 hartree
electener: -3095.30314484 hartree
oneelecener: -5470.14680734 hartree
twoeener: 2374.84366250 hartree
cpcmener: -0.03047684 hartree
kineticenergy: 1074.85743589 hartree
xcener: -106.459776130463 hartree
chargesum: 0.0000000
charge: -0.281951 -0.510308 -0.287709 0.148488 -0.013936 -0.100409 -0.286098 -0.281355 -0.295129 0.419017 -0.018272 -0.229063 -0.241538 0.093380 -0.082561 -0.327842 -0.032715 0.199683 -0.062098 0.058010 -0.204911 -0.206499 -0.157600 -0.151086 -0.181025 0.101766 0.095268 0.099353 0.093283 0.098160 0.100865 0.091067 0.097199 0.125017 0.094868 0.096510 0.090121 0.082577 0.101847 0.098402 0.112368 0.114374 0.165505 0.179044 0.109364 0.117976 0.142659 0.144096 0.159647 0.160619 0.161572
qa: -0.2820 -0.5103 -0.2877 0.1485 -0.0139 -0.1004 -0.2861 -0.2814 -0.2951 0.4190 -0.0183 -0.2291 -0.2415 0.0934 -0.0826 -0.3278 -0.0327 0.1997 -0.0621 0.0580 -0.2049 -0.2065 -0.1576 -0.1511 -0.1810 0.1018 0.0953 0.0994 0.0933 0.0982 0.1009 0.0911 0.0972 0.1250 0.0949 0.0965 0.0901 0.0826 0.1018 0.0984 0.1124 0.1144 0.1655 0.1790 0.1094 0.1180 0.1427 0.1441 0.1596 0.1606 0.1616
va: 2.1163 1.9898 2.2648 3.6985 3.8109 3.8372 3.9098 3.8913 3.8896 4.0919 3.7096 3.9293 3.9358 3.8435 3.7397 4.0014 3.9454 3.6377 3.8188 3.5776 3.9549 3.9407 3.8920 3.8832 3.8977 1.0268 1.0301 0.9998 1.0020 1.0028 0.9989 1.0178 1.0011 1.0023 0.9967 0.9959 1.0063 1.0131 0.9992 0.9988 1.0011 0.9927 1.0080 0.9932 1.0101 1.0074 1.0095 1.0030 0.9900 0.9895 0.9892
dispcorr: -0.021811766 hartree
energy: -1079.762274398686
dipole: 28.73335 -28.69650 0.03685 -4.74342 3.59450 -1.14892 -4.02831 4.40549 0.37718
magnitude: 1.20981 au
magnitude: 3.07508 debye
