program: Orca
programVersion: 5.0.2
elementType: O O O C C C C C C C C C C C C C C C C C C C C C C H H H H H H H H H H H H H H H H H H H H H H H H H H
charge: 0
multiplicity: 1
keywords: wb97x-d3
keywords: def2-TZVPP
keywords: def2/J RIJCOSX
keywords: DEFGRID2
keywords: scfconv7
keywords: smallprint printgap noloewdin
keywords: NOSOSCF
formula: C22H26O3
InChI: InChI=1/C22H26O3/c1-15(2)10-19-20(22(19,3)4)21(23)25-14-17-12-18(24-13-17)11-16-8-6-5-7-9-16/h5-10,12-13,19-20H,11,14H2,1-4H3
51 atoms
O  1.180127 0.421827 0.025742
O  2.751393 1.759168 0.879094
O  -3.211549 0.242871 -0.314931
C  4.685427 -0.526816 -0.111888
C  4.688846 0.602928 -1.079995
C  3.359648 0.006121 -0.637132
C  5.046839 -1.911077 -0.593706
C  5.11641 -0.270272 1.310975
C  5.132198 0.466398 -2.489277
C  2.442617 0.823923 0.1717
C  4.833688 1.331397 -3.462364
C  5.346888 1.146073 -4.857209
C  3.975792 2.540288 -3.253672
C  0.166716 1.162555 0.726447
C  -1.141382 0.53213 0.429356
C  -1.610833 -0.756912 0.845503
C  -2.156449 1.086208 -0.270801
C  -2.870728 -0.88067 0.368734
C  -3.909596 -1.933885 0.502597
C  -5.05917 -1.464281 1.361408
C  -6.163054 -0.837108 0.791689
C  -5.007645 -1.60839 2.745289
C  -7.195333 -0.361335 1.589667
C  -6.039041 -1.136768 3.545056
C  -7.135489 -0.508136 2.968836
H  4.886744 1.571658 -0.628662
H  2.867227 -0.641576 -1.353084
H  4.637509 -2.666052 0.0795
H  6.130824 -2.039783 -0.613251
H  4.666945 -2.121956 -1.593026
H  4.608382 -0.943698 2.00366
H  4.936151 0.75119 1.637848
H  6.188469 -0.455373 1.402325
H  5.75676 -0.388107 -2.732594
H  5.987474 0.269142 -4.946966
H  4.521908 1.037454 -5.565923
H  5.919203 2.018181 -5.183588
H  4.542275 3.454208 -3.447134
H  3.140966 2.543284 -3.958375
H  3.562599 2.609843 -2.249255
H  0.171119 2.204456 0.400008
H  0.372661 1.140954 1.79854
H  -1.07806 -1.488173 1.432955
H  -2.265376 2.035214 -0.772548
H  -3.439591 -2.8120 0.946567
H  -4.27562 -2.230552 -0.483776
H  -6.219761 -0.723643 -0.284377
H  -4.152548 -2.094484 3.200426
H  -8.048091 0.12399 1.132692
H  -5.986558 -1.259982 4.619137
H  -7.940112 -0.138465 3.591046
elementType: O C H
totalener: -1079.74093478 hartree
nucrepener: 2006.46442779 hartree
electener: -3086.20536256 hartree
oneelecener: -5452.03809260 hartree
twoeener: 2365.83273003 hartree
cpcmener: -0.03074998 hartree
kineticenergy: 1074.86206154 hartree
xcener: -106.460707411630 hartree
chargesum: -0.0000000
charge: -0.284163 -0.512811 -0.286583 0.151773 -0.039318 -0.068235 -0.291820 -0.274034 -0.282016 0.410490 -0.010965 -0.230103 -0.249233 0.090927 -0.084418 -0.320814 -0.028646 0.187206 -0.053798 0.060931 -0.200558 -0.209649 -0.159237 -0.153663 -0.179168 0.099601 0.090915 0.098699 0.101259 0.091844 0.100334 0.090334 0.096338 0.126212 0.089777 0.096106 0.094623 0.101233 0.096354 0.080232 0.111473 0.113581 0.165229 0.178622 0.110311 0.115582 0.143254 0.143976 0.159600 0.160778 0.161638
qa: -0.2842 -0.5128 -0.2866 0.1518 -0.0393 -0.0682 -0.2918 -0.2740 -0.2820 0.4105 -0.0110 -0.2301 -0.2492 0.0909 -0.0844 -0.3208 -0.0286 0.1872 -0.0538 0.0609 -0.2006 -0.2096 -0.1592 -0.1537 -0.1792 0.0996 0.0909 0.0987 0.1013 0.0918 0.1003 0.0903 0.0963 0.1262 0.0898 0.0961 0.0946 0.1012 0.0964 0.0802 0.1115 0.1136 0.1652 0.1786 0.1103 0.1156 0.1433 0.1440 0.1596 0.1608 0.1616
va: 2.1156 1.9837 2.2670 3.7180 3.8268 3.8306 3.9166 3.8810 3.8837 4.0968 3.7026 3.9280 3.9442 3.8440 3.7328 4.0005 3.9437 3.6466 3.8210 3.5652 3.9505 3.9417 3.8913 3.8855 3.8959 1.0255 1.0329 1.0027 0.9985 1.0009 0.9994 1.0188 1.0007 1.0027 1.0067 0.9959 0.9959 0.9984 0.9983 1.0148 1.0017 0.9925 1.0067 0.9933 1.0098 1.0052 1.0070 1.0031 0.9901 0.9895 0.9893
dispcorr: -0.021461125 hartree
energy: -1079.762395900038
dipole: 27.73057 -27.88005 -0.14947 -0.80952 -0.09590 -0.90542 -11.20488 10.60070 -0.60419
magnitude: 1.09871 au
magnitude: 2.79271 debye
