program: Orca
programVersion: 5.0.2
elementType: O O O C C C C C C C C C C C C C C C C C C C C C C H H H H H H H H H H H H H H H H H H H H H H H H H H
charge: 0
multiplicity: 1
keywords: wb97x-d3
keywords: def2-TZVPP
keywords: def2/J RIJCOSX
keywords: DEFGRID2
keywords: scfconv7
keywords: smallprint printgap noloewdin
keywords: NOSOSCF
formula: C22H26O3
InChI: InChI=1/C22H26O3/c1-15(2)10-19-20(22(19,3)4)21(23)25-14-17-12-18(24-13-17)11-16-8-6-5-7-9-16/h5-10,12-13,19-20H,11,14H2,1-4H3
51 atoms
O  1.033439 -1.223002 0.063079
O  2.767933 -0.824194 1.414403
O  -2.681448 -3.523945 -0.190283
C  4.088757 0.20475 -1.234436
C  3.579739 1.386618 -0.469031
C  2.650461 0.225965 -0.736819
C  4.255401 0.322823 -2.728817
C  5.12976 -0.67453 -0.588518
C  3.314845 2.694698 -1.118436
C  2.192689 -0.639244 0.364222
C  4.159295 3.729503 -1.106154
C  3.812427 5.026519 -1.77096
C  5.501113 3.693729 -0.440802
C  0.470712 -2.13077 1.027714
C  -0.913922 -2.441708 0.599899
C  -2.060985 -1.586408 0.686122
C  -1.354548 -3.599661 0.059856
C  -3.106272 -2.292097 0.194603
C  -4.553015 -1.990659 0.01353
C  -4.894038 -0.634244 0.564607
C  -4.707909 0.509898 -0.206069
C  -5.360017 -0.497471 1.868754
C  -4.980042 1.766886 0.31648
C  -5.63661 0.75799 2.393744
C  -5.444333 1.894107 1.619402
H  3.946832 1.437967 0.552248
H  1.909791 0.382387 -1.513683
H  3.45978 0.903287 -3.194681
H  4.259482 -0.665736 -3.191735
H  5.204557 0.805175 -2.971338
H  5.038103 -1.711072 -0.918982
H  5.089404 -0.660261 0.498016
H  6.122953 -0.32602 -0.879011
H  2.367683 2.804606 -1.63869
H  3.8319 5.851498 -1.05411
H  4.541478 5.275389 -2.546104
H  2.824395 5.002143 -2.23004
H  5.770317 2.707696 -0.065456
H  6.281288 4.009099 -1.137824
H  5.538454 4.394193 0.3979
H  0.471127 -1.670141 2.016839
H  1.077101 -3.037503 1.073084
H  -2.088882 -0.580167 1.073364
H  -0.861474 -4.527398 -0.186428
H  -5.150144 -2.758156 0.513882
H  -4.81001 -2.042683 -1.048757
H  -4.347873 0.416367 -1.223957
H  -5.509992 -1.380864 2.47817
H  -4.830437 2.647561 -0.29466
H  -6.001158 0.84815 3.408888
H  -5.657217 2.873462 2.027889
elementType: O C H
totalener: -1079.74075572 hartree
nucrepener: 2023.10911263 hartree
electener: -3102.84986835 hartree
oneelecener: -5485.26628947 hartree
twoeener: 2382.41642112 hartree
cpcmener: -0.02979512 hartree
kineticenergy: 1074.85229088 hartree
xcener: -106.459473074886 hartree
chargesum: -0.0000000
charge: -0.282274 -0.507727 -0.287525 0.142784 -0.005826 -0.121765 -0.268438 -0.301834 -0.265079 0.435938 -0.036535 -0.229298 -0.250061 0.083272 -0.115660 -0.277874 -0.025662 0.169133 0.004806 -0.002144 -0.199238 -0.192457 -0.155625 -0.156597 -0.170856 0.099388 0.090457 0.092282 0.099673 0.095983 0.103279 0.093501 0.096372 0.125014 0.094751 0.095019 0.089818 0.086949 0.095192 0.102045 0.110572 0.119964 0.163789 0.180226 0.104851 0.108580 0.143836 0.142217 0.160412 0.160446 0.161927
qa: -0.2823 -0.5077 -0.2875 0.1428 -0.0058 -0.1218 -0.2684 -0.3018 -0.2651 0.4359 -0.0365 -0.2293 -0.2501 0.0833 -0.1157 -0.2779 -0.0257 0.1691 0.0048 -0.0021 -0.1992 -0.1925 -0.1556 -0.1566 -0.1709 0.0994 0.0905 0.0923 0.0997 0.0960 0.1033 0.0935 0.0964 0.1250 0.0948 0.0950 0.0898 0.0869 0.0952 0.1020 0.1106 0.1200 0.1638 0.1802 0.1049 0.1086 0.1438 0.1422 0.1604 0.1604 0.1619
va: 2.1183 1.9928 2.2637 3.6591 3.7817 3.9162 3.9072 3.8985 3.8658 4.1179 3.7023 3.9272 3.9402 3.8411 3.7903 3.9527 3.9464 3.6940 3.8234 3.6228 3.9227 3.9297 3.8893 3.8889 3.8876 1.0227 1.0369 1.0022 1.0026 1.0022 0.9991 1.0190 1.0006 1.0063 0.9949 0.9962 1.0075 1.0075 0.9981 0.9977 0.9963 0.9985 1.0022 0.9936 1.0084 1.0046 1.0031 1.0036 0.9898 0.9897 0.9889
dispcorr: -0.021715065 hartree
energy: -1079.762470787597
dipole: 26.71159 -27.00600 -0.29440 19.55932 -19.18224 0.37708 -9.57026 8.69004 -0.88022
magnitude: 1.00183 au
magnitude: 2.54644 debye
