program: Orca
programVersion: 5.0.2
elementType: O O O C C C C C C C C C C C C C C C C C C C C C C H H H H H H H H H H H H H H H H H H H H H H H H H H
charge: 0
multiplicity: 1
keywords: wb97x-d3
keywords: def2-TZVPP
keywords: def2/J RIJCOSX
keywords: DEFGRID2
keywords: scfconv7
keywords: smallprint printgap noloewdin
keywords: NOSOSCF
formula: C22H26O3
InChI: InChI=1/C22H26O3/c1-15(2)10-19-20(22(19,3)4)21(23)25-14-17-12-18(24-13-17)11-16-8-6-5-7-9-16/h5-10,12-13,19-20H,11,14H2,1-4H3
51 atoms
O  1.219099 -1.116294 0.087769
O  3.304365 -1.862289 0.381968
O  -2.852168 -1.867906 1.486318
C  3.940094 0.427445 -1.710451
C  4.310054 0.855184 -0.333685
C  2.921995 0.297456 -0.584058
C  3.614151 1.479723 -2.742441
C  4.598028 -0.794648 -2.300516
C  4.482243 2.282454 0.042974
C  2.542419 -0.998559 0.00154
C  4.163365 2.800818 1.231801
C  4.393443 4.248397 1.540687
C  3.555839 2.002875 2.34364
C  0.690491 -2.306197 0.69933
C  -0.784469 -2.161281 0.733981
C  -1.692795 -2.191094 -0.37401
C  -1.547942 -1.959375 1.831299
C  -2.931886 -2.009402 0.136508
C  -4.274329 -1.894663 -0.48552
C  -4.821982 -0.488087 -0.414884
C  -5.983892 -0.205273 0.293757
C  -4.162341 0.55256 -1.065808
C  -6.482654 1.091225 0.348557
C  -4.65649 1.846669 -1.01267
C  -5.820319 2.12068 -0.303385
H  4.965924 0.160339 0.185987
H  2.117524 1.023088 -0.620269
H  3.092915 2.336807 -2.317108
H  2.97939 1.062554 -3.52579
H  4.525525 1.845468 -3.218768
H  3.933715 -1.297898 -3.004033
H  4.909055 -1.518438 -1.55192
H  5.490371 -0.496142 -2.852076
H  4.926009 2.935471 -0.703606
H  4.820554 4.787166 0.69527
H  3.458961 4.741914 1.819596
H  5.068287 4.363824 2.392484
H  3.445088 0.946101 2.10814
H  4.164115 2.080969 3.248063
H  2.569302 2.395504 2.603488
H  1.089902 -2.41914 1.708375
H  0.986485 -3.179174 0.115281
H  -1.448351 -2.331835 -1.415239
H  -1.311982 -1.874289 2.880664
H  -4.973076 -2.587807 -0.010449
H  -4.182035 -2.207032 -1.527618
H  -6.506285 -1.005079 0.804962
H  -3.253616 0.347482 -1.620177
H  -7.389325 1.294761 0.903568
H  -4.134077 2.643384 -1.526383
H  -6.206832 3.130553 -0.260842
elementType: O C H
totalener: -1079.74078210 hartree
nucrepener: 2045.10600954 hartree
electener: -3124.84679164 hartree
oneelecener: -5529.27235873 hartree
twoeener: 2404.42556709 hartree
cpcmener: -0.03067342 hartree
kineticenergy: 1074.86295081 hartree
xcener: -106.460858461594 hartree
chargesum: 0.0000000
charge: -0.281076 -0.512192 -0.287049 0.148136 -0.012952 -0.097432 -0.285526 -0.279156 -0.298427 0.415033 -0.014086 -0.229825 -0.243542 0.090721 -0.086176 -0.316957 -0.030500 0.196989 -0.050680 0.013740 -0.186370 -0.187590 -0.157299 -0.164805 -0.173674 0.101074 0.094102 0.093876 0.098459 0.099122 0.100511 0.089941 0.096544 0.124571 0.090116 0.095297 0.096535 0.081967 0.101571 0.099727 0.111258 0.115098 0.165585 0.179750 0.107060 0.117990 0.142244 0.147169 0.160002 0.160085 0.161043
qa: -0.2811 -0.5122 -0.2870 0.1481 -0.0130 -0.0974 -0.2855 -0.2792 -0.2984 0.4150 -0.0141 -0.2298 -0.2435 0.0907 -0.0862 -0.3170 -0.0305 0.1970 -0.0507 0.0137 -0.1864 -0.1876 -0.1573 -0.1648 -0.1737 0.1011 0.0941 0.0939 0.0985 0.0991 0.1005 0.0899 0.0965 0.1246 0.0901 0.0953 0.0965 0.0820 0.1016 0.0997 0.1113 0.1151 0.1656 0.1798 0.1071 0.1180 0.1422 0.1472 0.1600 0.1601 0.1610
va: 2.1132 1.9856 2.2634 3.7011 3.8073 3.8358 3.9099 3.8919 3.8917 4.0957 3.7068 3.9302 3.9371 3.8415 3.7396 3.9839 3.9467 3.6239 3.8189 3.6326 3.9379 3.9247 3.8868 3.9063 3.8932 1.0276 1.0304 1.0016 1.0029 0.9997 0.9991 1.0183 1.0011 1.0032 1.0061 0.9964 0.9960 1.0135 0.9993 0.9983 1.0018 0.9927 1.0064 0.9938 1.0098 1.0052 1.0032 1.0027 0.9901 0.9909 0.9895
dispcorr: -0.021902268 hartree
energy: -1079.762684372248
dipole: 21.54015 -22.23948 -0.69933 16.05965 -15.37881 0.68084 -4.44654 3.97692 -0.46962
magnitude: 1.08312 au
magnitude: 2.75307 debye
