program: Gaussian 09
title: 000071606
version: EM64L-G09RevD.01
frameworkgroup: C1[X(C7H12O2)]
method: RPBEPBE
basis: SDD
operation: Freq
keyword: #pfreq=noraman
keyword: PBEPBE/SDD
title: #p freq=noraman PBEPBE/SDD
converged: YES YES NO NO
title: Mulliken charges:
elementType: O O C C C C C C C H H H H H H H H H H H H
charge: -0.418123 -0.235421 -0.000108 -0.476676 -0.469425 -0.423929 -0.430766 -0.542204 0.179656 0.233558 0.193234 0.222678 0.251114 0.185011 0.205283 0.218756 0.219582 0.205745 0.249280 0.258456 0.374301
chargesum: 0.00000
title: Mulliken charges with hydrogens summed into heavy atoms:
elementType: O O C C C C C C C
charge: -0.043823 -0.235421 0.233450 -0.060764 -0.033300 0.000110 -0.005439 -0.034469 0.179656
polarizability: 9.31901691e+01 2.36914483e-01 7.56521122e+01 2.79262950e+00 -2.91479602e+00 6.42496618e+01
1716.lowfreq: -14.2360 -11.6000 -0.0006 -0.0004 0.0007 1.9830 6.7915 30.0035 77.3332
frequency: -5.1068 29.9635 77.3234 109.0011 189.0974 296.0405 330.9571 427.6941 501.1970 554.0114 612.6492 621.9902 643.2730 759.8798 807.0194 851.1662 855.6131 881.5858 901.1886 960.3819 972.7395 983.9757 1035.8653 1058.1333 1092.4016 1122.5686 1155.8301 1176.7089 1192.7997 1216.1156 1237.4931 1246.5319 1271.5672 1285.6437 1293.9239 1299.7619 1309.2571 1338.5237 1370.1647 1432.5192 1464.6782 1472.2276 1476.8023 1492.1243 1668.3935 2971.9417 2972.7660 2980.9158 2992.4117 2995.4741 3012.0076 3037.1780 3040.8685 3052.8518 3066.7789 3080.8332 3509.4444
redmass: 1.6408 5.5963 3.0184 3.8323 2.4056 3.5525 4.3020 1.9729 1.9636 3.5219 3.0922 2.8052 1.3772 1.2592 1.6040 2.5289 4.6682 2.3408 2.1844 1.5126 1.5873 1.5500 2.7117 2.6147 2.2991 2.0264 1.4272 1.4809 1.3162 1.2846 1.4133 1.3009 1.4091 1.2706 1.2551 1.3114 1.4438 1.6437 1.8535 1.0884 1.0798 1.0845 1.0831 1.1014 8.2640 1.0665 1.0672 1.0623 1.0772 1.0615 1.0653 1.0976 1.0975 1.1022 1.0991 1.1035 1.0639
irintensity: 0.0854 0.6398 0.1983 1.3040 1.0956 1.6523 5.6725 2.6322 24.0753 41.1195 4.3912 2.5836 135.0663 5.2990 2.0631 3.1550 3.1132 5.0535 0.5974 12.2771 0.2419 10.9380 269.1871 14.9409 2.3832 4.1124 12.7119 1.3016 1.5026 3.8703 0.1393 0.1456 8.9503 9.9163 8.6107 4.3184 1.4901 16.2870 31.6322 29.3225 1.7973 10.3534 11.6506 2.8663 195.6654 20.1014 25.2203 18.2672 36.1146 36.8377 52.8625 10.3309 31.7610 11.6284 18.5003 99.3620 18.0493
temp: 298.150 k
press: 1.00000 atm
elementType: 8 8 6 6 6 6 6 6 6 1 1 1 1 1 1 1 1 1 1 1 1
symmnumber: 1
zpe: 471270.4 jmol-1
zpe.correction: 0.179497 hartree
zpe.thermalcorrener: 0.188069 hartree
zpe.thermalcorrenthalpy: 0.189014 hartree
zpe.thermalcorrgfe: 0.144724 hartree
zpe.sumelectzpe: -423.681187 hartree
zpe.sumelectthermal: -423.672615 hartree
zpe.sumelectthermalent: -423.671671 hartree
zpe.sumelectthermalfe: -423.715961 hartree
dipole: -0.2652 -1.1874 0.6580
dipole: 1.3832
quadrupole: -49.9866 -57.6614 -55.6804
quadrupole: -0.0939 1.0330 2.7905
quadrupole: 4.4562 -3.2186 -1.2376 -0.0939 1.0330 2.7905
hfenergy: -423.8606845 hartree
pointgroup: C01 [X(C7H12O2)]
dipole: 0.1168066 -0.4644402 -0.258472 debye
dipolederiv: -1.1194373 -0.3558795 -0.3521685 -0.2691423 -0.4025453 -0.0492415 -0.3599614 -0.0682905 -0.5441474 -0.6801151 0.1225018 0.0278794 -0.1040391 -0.7549443 -0.3218542 -0.1255956 -0.2721848 -0.5113548 0.0879943 0.0001101 0.0099143 0.0062893 0.0457573 0.0162384 -0.0126415 -0.0300673 0.1205855 -0.040741 0.0012456 0.0094658 -0.0287862 0.0441991 -0.0133999 0.0130515 0.064752 0.1704497 -0.0357242 -0.0226979 -0.0210198 -0.000602 0.0051144 0.0891486 0.0035007 0.0399935 0.1322402 0.0319952 -0.0214451 -0.0215536 -0.0074852 0.0090841 0.0317897 -0.0057312 0.0057072 0.1495263 0.0215142 0.0079899 -0.0372876 -0.0009502 0.0682848 0.0255799 -0.0137529 0.0646411 0.1272028 -0.1674434 0.1044132 0.0018102 0.2390768 -0.1128193 -0.0786708 0.0435134 -0.063614 0.1137323 1.5115681 0.0344918 0.287522 0.0702707 0.9331454 0.5121953 0.3958609 0.4824643 0.584615 0.0566581 0.0052709 0.0071826 -0.01431 0.0222676 -0.0590808 0.018084 -0.0339452 -0.1298885 0.0322545 -0.0328199 -0.0356468 -0.0142704 0.003661 -0.0781621 -0.0173241 -0.1428129 -0.1244524 0.055479 -0.0118712 0.0069246 -0.0010553 -0.0969641 0.1198964 -0.0022701 0.1508174 -0.0423934 0.0100104 0.1136336 -0.004902 0.1137347 -0.0780735 0.0068081 -0.0000765 -0.0257839 0.0704802 0.0296435 -0.0271736 -0.0363023 -0.0341642 0.0439838 -0.0946474 -0.0513992 -0.0257425 -0.168092 -0.1241452 0.074736 0.0781527 0.0698488 0.018384 -0.0350963 0.1332733 -0.0504828 0.0082522 0.0141608 -0.0053597 -0.0679493 -0.0113508 0.0393485 -0.0085297 -0.1360094 0.0092374 -0.1447785 0.0414624 -0.0037287 -0.0226691 -0.0331173 -0.0718931 -0.09124 -0.0637667 -0.1412136 -0.0545311 -0.0435759 -0.072819 0.0951045 -0.0456764 0.0159607 0.0660695 0.1185112 0.1043518 -0.071767 0.0510596 0.0227878 0.0185685 -0.0087128 0.1026435 -0.0215018 -0.0258901 -0.0607471 -0.0797733 0.0283705 -0.0278431 0.0276866 -0.071268 -0.0371478 0.0715801 0.0360794 0.0905867 0.0594868 0.2390115 0.0944574 0.0292881 0.1457099 0.2025531 -0.0878816 0.0525444 -0.0976669 0.3346075 unknown
polarizability: 93.1556732|0.1490637|75.6462871|2.9092944|2.9879849|64.2899827 unknown
InChI: InChI=1S/C7H12O2/c8-7(9)5-6-3-1-2-4-6/h6,8H,1-5H2
charge 0 multiplicity 1
21 atoms
O  -3.246621 -0.498345 -0.54602
O  -2.146112 1.073167 0.758317
C  0.436118 -0.238851 0.272541
C  1.636962 -1.214871 0.165771
C  0.897883 0.96052 -0.595825
C  2.894173 -0.29706 0.214322
C  2.410097 1.118022 -0.264121
C  -0.898005 -0.870159 -0.160229
C  -2.101035 0.021053 0.084569
H  0.340459 0.107966 1.321323
H  1.587777 -1.748772 -0.805174
H  1.637684 -1.98086 0.963038
H  0.316498 1.876098 -0.393086
H  0.76286 0.705763 -1.667251
H  3.708598 -0.69241 -0.418758
H  3.28871 -0.239197 1.245394
H  2.548692 1.862577 0.541173
H  2.982552 1.479115 -1.137109
H  -0.881255 -1.144139 -1.23279
H  -1.082619 -1.816745 0.388354
H  -4.022416 0.094129 -0.348038
