program: Orca
programVersion: 5.0.2
elementType: O O O C C C C C C C C C C C C C C C C C C C C C C H H H H H H H H H H H H H H H H H H H H H H H H H H
charge: 0
multiplicity: 1
keywords: wb97x-d3
keywords: def2-TZVPP
keywords: def2/J RIJCOSX
keywords: DEFGRID2
keywords: scfconv7
keywords: smallprint printgap noloewdin
keywords: NOSOSCF
formula: C22H26O3
InChI: InChI=1/C22H26O3/c1-15(2)10-19-20(22(19,3)4)21(23)25-14-17-12-18(24-13-17)11-16-8-6-5-7-9-16/h5-10,12-13,19-20H,11,14H2,1-4H3
51 atoms
O  1.598644 -1.925863 -0.355791
O  0.832624 -0.66596 -2.037988
O  -2.330087 -2.556393 1.316963
C  1.774461 1.566214 0.022356
C  2.621253 1.545601 -1.205657
C  2.380024 0.252908 -0.462313
C  2.356584 2.111239 1.303041
C  0.290543 1.810579 -0.103787
C  3.981235 2.145493 -1.236601
C  1.529209 -0.79395 -1.054946
C  5.023349 1.643235 -1.903842
C  6.358307 2.322504 -1.897093
C  4.959469 0.376662 -2.700257
C  0.691698 -2.993938 -0.692455
C  -0.663624 -2.723506 -0.142186
C  -1.757137 -2.029323 -0.756798
C  -1.077632 -3.019111 1.111825
C  -2.739087 -1.952781 0.169795
C  -4.062228 -1.280115 0.187777
C  -4.014615 -0.024647 1.027268
C  -4.534192 -0.001563 2.316462
C  -3.398779 1.121383 0.529074
C  -4.445427 1.147508 3.093654
C  -3.309431 2.269714 1.301491
C  -3.833449 2.285623 2.588659
H  2.063026 1.625045 -2.135373
H  3.195468 -0.12013 0.146997
H  3.413511 1.872615 1.417744
H  1.829059 1.703093 2.166535
H  2.254528 3.19762 1.338938
H  -0.259255 1.2836 0.678128
H  -0.115146 1.505388 -1.06617
H  0.082459 2.876011 0.012127
H  4.116049 3.075764 -0.691621
H  7.130538 1.660349 -1.497521
H  6.670905 2.58194 -2.911594
H  6.35416 3.234803 -1.301174
H  5.296059 0.551744 -3.725044
H  5.632892 -0.376203 -2.282206
H  3.961287 -0.054691 -2.746958
H  1.12801 -3.877051 -0.229999
H  0.668989 -3.154068 -1.770282
H  -1.80433 -1.637627 -1.759529
H  -0.605803 -3.536253 1.932638
H  -4.833099 -1.956695 0.564309
H  -4.326745 -1.034506 -0.841623
H  -5.015164 -0.886185 2.716576
H  -2.983985 1.113296 -0.472488
H  -4.855089 1.151618 4.095413
H  -2.830154 3.152868 0.898592
H  -3.765095 3.180731 3.192925
elementType: O C H
totalener: -1079.73906912 hartree
nucrepener: 2149.38018531 hartree
electener: -3229.11925442 hartree
oneelecener: -5738.41513538 hartree
twoeener: 2509.29588095 hartree
cpcmener: -0.02864854 hartree
kineticenergy: 1074.86971342 hartree
xcener: -106.463430332258 hartree
chargesum: 0.0000000
charge: -0.288400 -0.501912 -0.283403 0.175984 -0.012839 -0.123976 -0.289995 -0.309234 -0.301686 0.422231 -0.018362 -0.228893 -0.241271 0.074154 -0.071827 -0.334943 -0.035259 0.208706 -0.048629 0.067418 -0.196033 -0.241127 -0.157667 -0.159571 -0.172942 0.103328 0.098445 0.095108 0.098199 0.099806 0.103618 0.093031 0.102294 0.124387 0.094798 0.096267 0.089908 0.101121 0.100044 0.080391 0.122577 0.120460 0.158974 0.178299 0.110311 0.115634 0.142468 0.154595 0.159950 0.164141 0.161324
qa: -0.2884 -0.5019 -0.2834 0.1760 -0.0128 -0.1240 -0.2900 -0.3092 -0.3017 0.4222 -0.0184 -0.2289 -0.2413 0.0742 -0.0718 -0.3349 -0.0353 0.2087 -0.0486 0.0674 -0.1960 -0.2411 -0.1577 -0.1596 -0.1729 0.1033 0.0984 0.0951 0.0982 0.0998 0.1036 0.0930 0.1023 0.1244 0.0948 0.0963 0.0899 0.1011 0.1000 0.0804 0.1226 0.1205 0.1590 0.1783 0.1103 0.1156 0.1425 0.1546 0.1599 0.1641 0.1613
va: 2.1182 1.9935 2.2663 3.7004 3.8134 3.8221 3.9009 3.8960 3.8885 4.1249 3.7124 3.9300 3.9333 3.8383 3.6377 3.9771 3.9668 3.6280 3.8134 3.5520 3.9537 3.9145 3.8895 3.8746 3.9001 1.0259 1.0293 1.0020 1.0031 0.9997 0.9912 1.0153 1.0022 1.0028 0.9965 0.9961 1.0061 0.9999 0.9982 1.0162 0.9968 1.0074 1.0186 0.9928 1.0096 1.0078 1.0043 0.9959 0.9897 0.9877 0.9891
dispcorr: -0.025399759 hartree
energy: -1079.764468874384
dipole: 20.89340 -20.37338 0.52003 15.68549 -15.79553 -0.11004 -3.76474 4.36469 0.59995
magnitude: 0.80155 au
magnitude: 2.03737 debye
