program: Orca
programVersion: 5.0.2
elementType: O O O C C C C C C C C C C C C C C C C C C C C C C H H H H H H H H H H H H H H H H H H H H H H H H H H
charge: 0
multiplicity: 1
keywords: wb97x-d3
keywords: def2-TZVPP
keywords: def2/J RIJCOSX
keywords: DEFGRID2
keywords: scfconv7
keywords: smallprint printgap noloewdin
keywords: NOSOSCF
formula: C22H26O3
InChI: InChI=1/C22H26O3/c1-15(2)10-19-20(22(19,3)4)21(23)25-14-17-12-18(24-13-17)11-16-8-6-5-7-9-16/h5-10,12-13,19-20H,11,14H2,1-4H3
51 atoms
O  1.577184 -1.84956 -0.374973
O  0.693447 -0.605852 -2.011981
O  -2.240136 -2.734472 1.481036
C  1.772177 1.685918 -0.108642
C  2.586294 1.585255 -1.352547
C  2.327874 0.332662 -0.53737
C  2.393782 2.268384 1.136823
C  0.293688 1.971344 -0.215718
C  3.963228 2.131176 -1.459225
C  1.447979 -0.720972 -1.070362
C  4.86004 1.747701 -2.371556
C  6.222543 2.366758 -2.438296
C  4.591289 0.685092 -3.392568
C  0.701332 -2.951746 -0.680083
C  -0.632883 -2.755853 -0.052475
C  -1.774756 -2.067848 -0.580061
C  -0.981995 -3.13843 1.198422
C  -2.717624 -2.080111 0.38977
C  -4.050532 -1.436339 0.507223
C  -3.957201 -0.17748 1.338861
C  -3.343061 0.956974 0.812182
C  -4.425093 -0.14183 2.647241
C  -3.19706 2.103098 1.578822
C  -4.280172 1.005775 3.418727
C  -3.663478 2.129445 2.888112
H  2.006262 1.625764 -2.270706
H  3.149078 -0.030631 0.070293
H  2.337666 3.358629 1.120225
H  3.440359 1.989711 1.256467
H  1.858538 1.92525 2.023864
H  -0.139294 1.646959 -1.159607
H  0.121951 3.046358 -0.13239
H  -0.256226 1.488694 0.594556
H  4.243788 2.908303 -0.754355
H  7.001196 1.612332 -2.299965
H  6.401457 2.81695 -3.418175
H  6.361263 3.139108 -1.682082
H  3.625414 0.198017 -3.266099
H  4.625942 1.101827 -4.402955
H  5.363263 -0.087736 -3.354091
H  1.20126 -3.821417 -0.259242
H  0.626122 -3.094397 -1.757772
H  -1.878221 -1.619989 -1.555167
H  -0.459991 -3.687848 1.966788
H  -4.775524 -2.126244 0.94479
H  -4.399726 -1.198314 -0.49849
H  -2.969513 0.939986 -0.205619
H  -4.904811 -1.017102 3.068982
H  -2.717008 2.975994 1.154633
H  -4.647237 1.018455 4.436915
H  -3.549546 3.022592 3.48859
elementType: O C H
totalener: -1079.73929742 hartree
nucrepener: 2140.45057237 hartree
electener: -3220.18986979 hartree
oneelecener: -5720.53841746 hartree
twoeener: 2500.34854767 hartree
cpcmener: -0.02865662 hartree
kineticenergy: 1074.85712204 hartree
xcener: -106.461111046337 hartree
chargesum: -0.0000000
charge: -0.288144 -0.507278 -0.283874 0.178756 -0.044339 -0.093894 -0.296889 -0.301001 -0.284197 0.422812 -0.015868 -0.228976 -0.246821 0.074162 -0.081142 -0.325879 -0.033387 0.210553 -0.051891 0.050118 -0.219430 -0.198234 -0.166035 -0.153824 -0.175547 0.100845 0.094237 0.101197 0.093104 0.099223 0.094643 0.101353 0.101778 0.126589 0.095480 0.095029 0.089732 0.078835 0.101374 0.095892 0.121722 0.120525 0.160485 0.179284 0.108704 0.116378 0.154716 0.142449 0.165737 0.159907 0.161028
qa: -0.2881 -0.5073 -0.2839 0.1788 -0.0443 -0.0939 -0.2969 -0.3010 -0.2842 0.4228 -0.0159 -0.2290 -0.2468 0.0742 -0.0811 -0.3259 -0.0334 0.2106 -0.0519 0.0501 -0.2194 -0.1982 -0.1660 -0.1538 -0.1755 0.1008 0.0942 0.1012 0.0931 0.0992 0.0946 0.1014 0.1018 0.1266 0.0955 0.0950 0.0897 0.0788 0.1014 0.0959 0.1217 0.1205 0.1605 0.1793 0.1087 0.1164 0.1547 0.1424 0.1657 0.1599 0.1610
va: 2.1206 1.9866 2.2670 3.7024 3.8442 3.8144 3.9094 3.8880 3.8790 4.1161 3.7083 3.9279 3.9414 3.8399 3.6482 3.9780 3.9650 3.6324 3.8217 3.5886 3.9120 3.9526 3.8835 3.8866 3.9026 1.0251 1.0323 0.9987 1.0012 1.0024 1.0158 1.0022 0.9938 1.0021 0.9962 0.9956 1.0064 1.0172 0.9983 0.9987 0.9972 1.0073 1.0181 0.9923 1.0118 1.0077 0.9960 1.0037 0.9863 0.9896 0.9895
dispcorr: -0.024856285 hartree
energy: -1079.764153709337
dipole: 20.33148 -19.76931 0.56217 16.84030 -16.89377 -0.05346 -6.36725 6.87151 0.50426
magnitude: 0.75708 au
magnitude: 1.92435 debye
