program: Orca
programVersion: 5.0.2
elementType: O O O C C C C C C C C C C C C C C C C C C C C C C H H H H H H H H H H H H H H H H H H H H H H H H H H
charge: 0
multiplicity: 1
keywords: wb97x-d3
keywords: def2-TZVPP
keywords: def2/J RIJCOSX
keywords: DEFGRID2
keywords: scfconv7
keywords: smallprint printgap noloewdin
keywords: NOSOSCF
formula: C22H26O3
InChI: InChI=1/C22H26O3/c1-15(2)10-19-20(22(19,3)4)21(23)25-14-17-12-18(24-13-17)11-16-8-6-5-7-9-16/h5-10,12-13,19-20H,11,14H2,1-4H3
51 atoms
O  1.716831 -2.081236 -1.089986
O  1.926337 -1.795418 1.117263
O  -2.109495 -2.908797 1.022877
C  3.563289 0.756617 0.415352
C  2.129208 1.166455 0.436518
C  2.551711 -0.038123 -0.390899
C  4.529711 1.564575 -0.417738
C  4.192867 0.203276 1.669583
C  1.669636 2.421977 -0.211332
C  2.053481 -1.370375 -0.009086
C  0.706116 2.550697 -1.127574
C  0.358706 3.892357 -1.696935
C  -0.095286 1.408628 -1.671357
C  0.986254 -3.302981 -0.892094
C  -0.36525 -3.012659 -0.345129
C  -1.320577 -2.08899 -0.877109
C  -0.90012 -3.475435 0.806992
C  -2.352229 -2.051341 -0.002085
C  -3.560335 -1.187393 0.080961
C  -3.205759 0.260062 0.345765
C  -3.861379 1.281861 -0.332755
C  -2.215546 0.599807 1.267186
C  -3.538479 2.61367 -0.099138
C  -1.888441 1.927272 1.499754
C  -2.549366 2.941384 0.816671
H  1.607293 0.906091 1.356099
H  2.593436 0.126929 -1.461298
H  4.078458 1.935541 -1.337988
H  5.395539 0.959721 -0.693174
H  4.89504 2.426055 0.144764
H  4.968077 -0.527988 1.434471
H  3.477756 -0.263869 2.340825
H  4.668765 1.017422 2.219194
H  2.177697 3.323938 0.121585
H  -0.682579 4.148908 -1.483737
H  0.991374 4.686216 -1.300724
H  0.458947 3.891323 -2.785382
H  0.02325 0.491654 -1.100992
H  -1.158285 1.660393 -1.682401
H  0.181673 1.199555 -2.708332
H  1.536688 -3.9917 -0.248912
H  0.931734 -3.743847 -1.8865
H  -1.233306 -1.503437 -1.779307
H  -0.550569 -4.178451 1.546717
H  -4.219671 -1.559597 0.869408
H  -4.128524 -1.255022 -0.848492
H  -4.627541 1.035449 -1.058423
H  -1.684947 -0.175944 1.806709
H  -4.057167 3.394238 -0.640745
H  -1.11213 2.169946 2.214098
H  -2.291222 3.977162 0.994913
elementType: O C H
totalener: -1079.73617906 hartree
nucrepener: 2263.23095817 hartree
electener: -3342.96713722 hartree
oneelecener: -5966.14857576 hartree
twoeener: 2623.18143853 hartree
cpcmener: -0.02892002 hartree
kineticenergy: 1074.85794864 hartree
xcener: -106.466566264559 hartree
chargesum: 0.0000000
charge: -0.294375 -0.498128 -0.282100 0.149729 0.000391 -0.104918 -0.282267 -0.291524 -0.300552 0.397333 -0.023753 -0.226369 -0.214466 0.095546 -0.064755 -0.369342 -0.031801 0.234339 -0.028086 0.021278 -0.193467 -0.204218 -0.130504 -0.148356 -0.204512 0.101584 0.103025 0.091190 0.099223 0.099027 0.100091 0.091118 0.094102 0.120612 0.091475 0.090862 0.099971 0.034920 0.099204 0.122471 0.119273 0.122305 0.167507 0.178955 0.104572 0.104793 0.139419 0.140150 0.158052 0.159322 0.161651
qa: -0.2944 -0.4981 -0.2821 0.1497 0.0004 -0.1049 -0.2823 -0.2915 -0.3006 0.3973 -0.0238 -0.2264 -0.2145 0.0955 -0.0648 -0.3693 -0.0318 0.2343 -0.0281 0.0213 -0.1935 -0.2042 -0.1305 -0.1484 -0.2045 0.1016 0.1030 0.0912 0.0992 0.0990 0.1001 0.0911 0.0941 0.1206 0.0915 0.0909 0.1000 0.0349 0.0992 0.1225 0.1193 0.1223 0.1675 0.1790 0.1046 0.1048 0.1394 0.1401 0.1581 0.1593 0.1617
va: 2.1057 1.9982 2.2599 3.7279 3.7712 3.8347 3.9029 3.8850 3.8550 4.1305 3.7377 3.9228 3.8981 3.8393 3.6336 3.9400 3.9444 3.5958 3.8005 3.6470 3.9263 3.8504 3.8488 3.8138 3.8528 1.0217 1.0275 1.0039 1.0025 1.0012 0.9986 1.0216 1.0006 1.0054 0.9969 1.0066 0.9970 1.0185 1.0002 1.0037 1.0048 0.9898 1.0039 0.9926 1.0118 1.0071 1.0037 1.0101 0.9902 0.9912 0.9895
dispcorr: -0.030338526 hartree
energy: -1079.766517581332
dipole: 11.54191 -11.75254 -0.21062 19.05255 -18.47651 0.57604 -5.72501 4.40575 -1.31926
magnitude: 1.45486 au
magnitude: 3.69796 debye
